{"text_format":"1","workbook":"xlsx","n_sheets":6,"sheets":["Dashboard","Data","Mfg Jobs By Party and Region","Cons Above average mfg","2022emp","redundant Data"],"not_rendered":{"charts":0,"images":2,"macros":1,"external_links":0,"defined_names":2,"comments":3,"pivot_tables":1},"unopened":[],"bounds":{"document_bytes":16777216,"sheet_cells":100000,"rows_first":2000,"rows_last":500,"rows_between":2000,"halvings":0,"cell_chars":16384,"cell_head_chars":4096},"cells_cut":0,"cells_raw":0,"read":"whole","date_system":"1900"}

{"sheet":"Dashboard","index":0,"n_rows":12,"n_cols":8,"rows_kept":12,"cut":false,"hidden":false,"merged":[]}
[]
[]
[]
[]
[]
[null,"Enter the Constituency you want Manufacturing statistics for below         (Type or select from drop-down)","Employees in the manufacturing sector in this constituency","Total employees in the constituency","Constituency's dependance on manufacturing (% Mfg jobs)","Number of manufacturing businesses  in this constituency","Who is the Member of Parliament for this constituency?","Party"]
[null,"Richmond (Yorks)",{"$f":"VLOOKUP(B7,Data!B9:AE658,27,FALSE)","v":4000},{"$f":"VLOOKUP(B7,Data!B9:AE658,28,FALSE)","v":43000},{"$f":"VLOOKUP(B7,Data!B9:AH658,33,FALSE) & \" (\" &VLOOKUP(B7,Data!B9:AI658,34,FALSE)&\"%)\"","v":"Manufacturing Dependent (9.3%)"},{"$f":"VLOOKUP(B7,Data!B9:AA658,26,FALSE)","v":260},{"$f":"((VLOOKUP(B7,Data!B9:N658,10,FALSE)) & \" \" &  (VLOOKUP(B7,Data!B9:N658,11,FALSE)))","v":"Rishi Sunak"},{"$f":"VLOOKUP(B7,Data!B9:N658,12,FALSE)","v":"Conservative"}]
[]
[]
[]
[null,null,"How many manufacturing businesses has this constituency gained (or lost) in the past 5 years?","Did the Party hold or change in the December 2019 GE?","Full-Time Employees in this constituency's Manufacturing Sector","Part-Time employees in this constituency's Manufacturing Sector"]
[null,null,{"$f":"VLOOKUP(B7,Data!B9:AF658,31,FALSE)","v":0},{"$f":"VLOOKUP(B7,Data!B9:N658,13,FALSE) & \",\" & \" \" &  \" \" & (VLOOKUP(B7,Data!B9:T658,19,FALSE)) & \" \"","v":"Hold,  Same MP "},{"$f":"VLOOKUP(B7,Data!B9:AE658,29,FALSE)","v":3500},{"$f":"VLOOKUP(B7,Data!B9:AE658,30,FALSE)","v":600},null,"N.B All numbers are rounded according to ONS convention, as such, component parts may not always sum perfectly."]

{"sheet":"Data","index":1,"n_rows":692,"n_cols":35,"rows_kept":692,"cut":false,"hidden":true,"merged":[[6,10,6,12],[6,14,6,16]]}
["JB Manufacturing Constituency Tool"]
["Sources: ONS, Theyworkforyou, Parliament",null,"Use the filters below to extract data to requirements. E.g. You could find newly elected MPs in constituencies in the North East which are manufacturing dependent who held conservative in the 2019 GE"]
[]
[]
[null,null,null,null,"Yellow: Above average",null,null,null,null,null,null,null,null,null,null,null,null,null,null,null,null,null,null,null,null,null,null,null,null,null,null,null,"Yellow: Above average"]
[null,null,"Data missing (NI)",null,"Orange: Above 2x the average",null,null,null,null,null,null,null,null,null,null,null,null,null,null,null,null,null,null,null,null,null,null,null,null,null,null,null,"Orange: Above 2x the average"]
[null,null,null,null,"Red: Above 3x the average",null,null,null,null,null,"MPs 10/04/2024",null,null,null,"Post December 2019 MPs",null,null,"Full-time Mfg employees","Part-time Mfg employees",null,null,null,null,null,null,null,null,null,null,null,null,null,"Red: Above 3x the average"]
["Region","parliamentary constituency 2010","Mfg Employee count 2020","Total Constit Employee count 2018","MFG job percent of total (Yellow higher than average :manufacturing dependent)","2021 Mfg Business count","2018 Mfg Business count","2019 Mfg Business count","2-Year Change Business Count","3-Year Change Business Count","First name","Last name","Party","Hold or Change","First name","Last name","Party","number","number","New or Same MP?","MP name Conc","Full time emp UNADJ FOR NI","Dependent string",null,null,null,"2023 Mfg Business count","2022 Mfg Employee Count","2022 Total Employee count","2022  Mfg FT Employees","2022 Mfg PT Employees","5  Year Mfg Business count change","2022 Dependency","Dependent String 2022","2022 Dependency Rounded"]
["Wales","Aberavon",8000,34000,{"$f":"(C9/D9)*100","v":23.52941176470588},115,105,110,{"$f":"F9-H9","v":5},{"$f":"F9-G9","v":10},"Stephen","Kinnock","Labour",{"$f":"IF(M9=Q9, \"Hold\", \"Change\")","v":"Hold"},"Stephen","Kinnock","Labour",7000,350,{"$f":"IF(L9=P9, \"Same MP\", \"New MP\")","v":"Same MP"},{"$f":"CONCATENATE(K9,\" \",L9)","v":"Stephen Kinnock"},null,{"$f":"IF(E9>24.29, \"Extremely Manufacturing Dependent\", IF(E9>16.59, \"Very Manufacturing Dependent\", IF(E9>8.09, \"Manufacturing Dependent\", \"Not Manufacturing Dependent\")))","v":"Very Manufacturing Dependent"},25.806451612903224,{"$f":"ROUND(X9,1)","v":25.8},25.8,115,{"$f":"VLOOKUP(B9,'2022emp'!$A$2:$B$633,2,FALSE)","v":7000},{"$f":"VLOOKUP(B9,'2022emp'!$A$2:$F$633,4,FALSE)","v":34000},{"$f":"VLOOKUP(B9,'2022emp'!$A$2:$H$633,7,FALSE)","v":7000},{"$f":"VLOOKUP(B9,'2022emp'!$A$2:$H$633,8,FALSE)","v":350},{"$f":"AA9-G9","v":10},{"$f":"(AB9/AC9)*100","v":20.588235294117645},{"$f":"IF(AG9>26.79, \"Extremely Manufacturing Dependent\", IF(AG9>17.86, \"Very Manufacturing Dependent\", IF(AG9>8.93, \"Manufacturing Dependent\", \"Not Manufacturing Dependent\")))","v":"Very Manufacturing Dependent"},{"$f":"ROUND(AG9,1)","v":20.6}]
["Wales","Aberconwy",600,23000,{"$f":"(C10/D10)*100","v":2.6086956521739131},110,100,105,5,10,"Robin","Millar","Conservative",{"$f":"IF(M10=Q10, \"Hold\", \"Change\")","v":"Hold"},"Robin John","Millar","Conservative",500,75,{"$f":"IF(L10=P10, \"Same MP\", \"New MP\")","v":"Same MP"},"Robin Millar",null,"Not Manufacturing Dependent",2.2222222222222223,{"$f":"ROUND(X10,1)","v":2.2000000000000002},2.2000000000000002,95,{"$f":"VLOOKUP(B10,'2022emp'!$A$2:$B$633,2,FALSE)","v":600},{"$f":"VLOOKUP(B10,'2022emp'!$A$2:$F$633,4,FALSE)","v":22000},{"$f":"VLOOKUP(B10,'2022emp'!$A$2:$H$633,7,FALSE)","v":500},{"$f":"VLOOKUP(B10,'2022emp'!$A$2:$H$633,8,FALSE)","v":75},{"$f":"AA10-G10","v":-5},{"$f":"(AB10/AC10)*100","v":2.7272727272727271},{"$f":"IF(AG10>26.79, \"Extremely Manufacturing Dependent\", IF(AG10>17.86, \"Very Manufacturing Dependent\", IF(AG10>8.93, \"Manufacturing Dependent\", \"Not Manufacturing Dependent\")))","v":"Not Manufacturing Dependent"},{"$f":"ROUND(AG10,1)","v":2.7}]
["Scotland","Aberdeen North",1250,71000,{"$f":"(C11/D11)*100","v":1.7605633802816902},95,100,100,-5,-5,"Kirsty","Blackman","Scottish National Party","Hold","Kirsty","Blackman","Scottish National Party",1250,75,{"$f":"IF(L11=P11, \"Same MP\", \"New MP\")","v":"Same MP"},"Kirsty Blackman",null,"Not Manufacturing Dependent",1.3333333333333335,1.3,1.3,90,{"$f":"VLOOKUP(B11,'2022emp'!$A$2:$B$633,2,FALSE)","v":700},{"$f":"VLOOKUP(B11,'2022emp'!$A$2:$F$633,4,FALSE)","v":69000},{"$f":"VLOOKUP(B11,'2022emp'!$A$2:$H$633,7,FALSE)","v":600},{"$f":"VLOOKUP(B11,'2022emp'!$A$2:$H$633,8,FALSE)","v":75},-10,1.0144927536231882,"Not Manufacturing Dependent",1]
["Scotland","Aberdeen South",3500,56000,6.25,200,205,195,5,-5,"Stephen","Flynn","Scottish National Party","Hold","Stephen","Flynn","Scottish National Party",3000,350,"Same MP","Stephen Flynn",null,"Not Manufacturing Dependent",4.918032786885246,4.9000000000000004,4.9000000000000004,190,{"$f":"VLOOKUP(B12,'2022emp'!$A$2:$B$633,2,FALSE)","v":3000},{"$f":"VLOOKUP(B12,'2022emp'!$A$2:$F$633,4,FALSE)","v":56000},{"$f":"VLOOKUP(B12,'2022emp'!$A$2:$H$633,7,FALSE)","v":2500},{"$f":"VLOOKUP(B12,'2022emp'!$A$2:$H$633,8,FALSE)","v":350},-15,5.3571428571428568,"Not Manufacturing Dependent",5.4]
["Scotland","Airdrie and Shotts",2250,30000,7.5,150,145,145,5,5,"Anum","Qaisar","Scottish National Party","Hold","Neil","Gray","Scottish National Party",2000,200,"New MP","Anum Qaisar",null,"Not Manufacturing Dependent",6.666666666666667,6.7,6.7,140,{"$f":"VLOOKUP(B13,'2022emp'!$A$2:$B$633,2,FALSE)","v":2500},{"$f":"VLOOKUP(B13,'2022emp'!$A$2:$F$633,4,FALSE)","v":34000},{"$f":"VLOOKUP(B13,'2022emp'!$A$2:$H$633,7,FALSE)","v":2250},{"$f":"VLOOKUP(B13,'2022emp'!$A$2:$H$633,8,FALSE)","v":250},-5,7.3529411764705888,"Not Manufacturing Dependent",7.4]
["South East","Aldershot",3000,52000,5.7692307692307692,205,215,215,-10,-10,"Leo","Docherty","Conservative","Hold","Leo","Docherty","Conservative",2500,300,"Same MP","Leo Docherty",null,"Not Manufacturing Dependent",6.3636363636363633,6.4,6.4,190,{"$f":"VLOOKUP(B14,'2022emp'!$A$2:$B$633,2,FALSE)","v":3000},{"$f":"VLOOKUP(B14,'2022emp'!$A$2:$F$633,4,FALSE)","v":63000},{"$f":"VLOOKUP(B14,'2022emp'!$A$2:$H$633,7,FALSE)","v":2500},{"$f":"VLOOKUP(B14,'2022emp'!$A$2:$H$633,8,FALSE)","v":300},-25,4.7619047619047619,"Not Manufacturing Dependent",4.8]
["West Midlands","Aldridge-Brownhills",4500,23000,19.565217391304348,260,240,250,10,20,"Wendy","Morton","Conservative","Hold","Wendy","Morton","Conservative",4000,400,"Same MP","Wendy Morton",null,"Very Manufacturing Dependent",20,20,20,245,{"$f":"VLOOKUP(B15,'2022emp'!$A$2:$B$633,2,FALSE)","v":4500},{"$f":"VLOOKUP(B15,'2022emp'!$A$2:$F$633,4,FALSE)","v":24000},{"$f":"VLOOKUP(B15,'2022emp'!$A$2:$H$633,7,FALSE)","v":4000},{"$f":"VLOOKUP(B15,'2022emp'!$A$2:$H$633,8,FALSE)","v":500},5,18.75,"Very Manufacturing Dependent",18.8]
["North West","Altrincham and Sale West",2500,51000,4.9019607843137258,185,185,175,10,0,"Graham","Brady","Conservative","Hold","Graham","Brady","Conservative",2000,400,"Same MP","Graham Brady",null,"Not Manufacturing Dependent",3.8461538461538463,3.8,3.8,165,{"$f":"VLOOKUP(B16,'2022emp'!$A$2:$B$633,2,FALSE)","v":1250},{"$f":"VLOOKUP(B16,'2022emp'!$A$2:$F$633,4,FALSE)","v":74000},{"$f":"VLOOKUP(B16,'2022emp'!$A$2:$H$633,7,FALSE)","v":1000},{"$f":"VLOOKUP(B16,'2022emp'!$A$2:$H$633,8,FALSE)","v":150},-20,1.6891891891891893,"Not Manufacturing Dependent",1.7]
["Wales","Alyn and Deeside",15000,48000,31.25,235,240,245,-10,-5,"Mark","Tami","Labour",{"$f":"IF(M17=Q17, \"Hold\", \"Change\")","v":"Hold"},"Mark","Tami","Labour",15000,600,"Same MP","Mark Tami",null,"Extremely Manufacturing Dependent",34.693877551020407,34.700000000000003,34.700000000000003,230,{"$f":"VLOOKUP(B17,'2022emp'!$A$2:$B$633,2,FALSE)","v":13000},{"$f":"VLOOKUP(B17,'2022emp'!$A$2:$F$633,4,FALSE)","v":48000},{"$f":"VLOOKUP(B17,'2022emp'!$A$2:$H$633,7,FALSE)","v":13000},{"$f":"VLOOKUP(B17,'2022emp'!$A$2:$H$633,8,FALSE)","v":500},-10,27.083333333333332,"Extremely Manufacturing Dependent",27.1]
["East Midlands","Amber Valley",9000,37000,24.324324324324326,310,290,290,20,20,"Nigel","Mills","Conservative","Hold","Nigel","Mills","Conservative",8000,1000,"Same MP","Nigel Mills",null,"Extremely Manufacturing Dependent",23.684210526315788,23.7,23.7,305,{"$f":"VLOOKUP(B18,'2022emp'!$A$2:$B$633,2,FALSE)","v":8000},{"$f":"VLOOKUP(B18,'2022emp'!$A$2:$F$633,4,FALSE)","v":38000},{"$f":"VLOOKUP(B18,'2022emp'!$A$2:$H$633,7,FALSE)","v":7000},{"$f":"VLOOKUP(B18,'2022emp'!$A$2:$H$633,8,FALSE)","v":600},15,21.052631578947366,"Very Manufacturing Dependent",21.1]
["Scotland","Angus",4500,26000,17.307692307692307,195,190,195,0,5,"Dave","Doogan","Scottish National Party","Hold","Dave","Doogan","Scottish National Party",4000,250,"Same MP","Dave Doogan",null,"Very Manufacturing Dependent",16.071428571428573,16.100000000000001,16.100000000000001,175,{"$f":"VLOOKUP(B19,'2022emp'!$A$2:$B$633,2,FALSE)","v":4500},{"$f":"VLOOKUP(B19,'2022emp'!$A$2:$F$633,4,FALSE)","v":28000},{"$f":"VLOOKUP(B19,'2022emp'!$A$2:$H$633,7,FALSE)","v":4000},{"$f":"VLOOKUP(B19,'2022emp'!$A$2:$H$633,8,FALSE)","v":350},-15,16.071428571428573,"Manufacturing Dependent",16.100000000000001]
["Wales","Arfon",1250,30000,4.1666666666666661,105,100,105,0,5,"Hywel","Williams","Plaid Cymru","Hold","Hywel","Williams","Plaid Cymru",1250,100,"Same MP","Hywel Williams",null,"Not Manufacturing Dependent",4.6875,4.7,4.7,110,{"$f":"VLOOKUP(B20,'2022emp'!$A$2:$B$633,2,FALSE)","v":1750},{"$f":"VLOOKUP(B20,'2022emp'!$A$2:$F$633,4,FALSE)","v":32000},{"$f":"VLOOKUP(B20,'2022emp'!$A$2:$H$633,7,FALSE)","v":1750},{"$f":"VLOOKUP(B20,'2022emp'!$A$2:$H$633,8,FALSE)","v":150},10,5.46875,"Not Manufacturing Dependent",5.5]
["Scotland","Argyll and Bute",2000,33000,6.0606060606060606,195,185,185,10,10,"Brendan","O'Hara","Scottish National Party","Hold","Brendan","O'Hara","Scottish National Party",1750,350,"Same MP","Brendan O'Hara",null,"Not Manufacturing Dependent",5.7142857142857144,5.7,5.7,205,{"$f":"VLOOKUP(B21,'2022emp'!$A$2:$B$633,2,FALSE)","v":1750},{"$f":"VLOOKUP(B21,'2022emp'!$A$2:$F$633,4,FALSE)","v":36000},{"$f":"VLOOKUP(B21,'2022emp'!$A$2:$H$633,7,FALSE)","v":1500},{"$f":"VLOOKUP(B21,'2022emp'!$A$2:$H$633,8,FALSE)","v":250},20,4.8611111111111116,"Not Manufacturing Dependent",4.9000000000000004]
["South East","Arundel and South Downs",2500,34000,7.3529411764705888,325,320,320,5,5,"Andrew","Griffith","Conservative","Hold","Andrew","Griffith","Conservative",2250,350,"Same MP","Andrew Griffith",null,"Not Manufacturing Dependent",7.3529411764705888,7.4,7.4,325,{"$f":"VLOOKUP(B22,'2022emp'!$A$2:$B$633,2,FALSE)","v":2500},{"$f":"VLOOKUP(B22,'2022emp'!$A$2:$F$633,4,FALSE)","v":36000},{"$f":"VLOOKUP(B22,'2022emp'!$A$2:$H$633,7,FALSE)","v":2250},{"$f":"VLOOKUP(B22,'2022emp'!$A$2:$H$633,8,FALSE)","v":400},5,6.9444444444444446,"Not Manufacturing Dependent",6.9]
["East Midlands","Ashfield",8000,48000,16.666666666666664,270,280,275,-5,-10,"Lee","Anderson","Reform UK","Change","Lee","Anderson","Conservative",7000,600,"Same MP","Lee Anderson",null,"Very Manufacturing Dependent",18,18,18,260,{"$f":"VLOOKUP(B23,'2022emp'!$A$2:$B$633,2,FALSE)","v":8000},{"$f":"VLOOKUP(B23,'2022emp'!$A$2:$F$633,4,FALSE)","v":53000},{"$f":"VLOOKUP(B23,'2022emp'!$A$2:$H$633,7,FALSE)","v":7000},{"$f":"VLOOKUP(B23,'2022emp'!$A$2:$H$633,8,FALSE)","v":500},-20,15.09433962264151,"Manufacturing Dependent",15.1]
["South East","Ashford",4000,54000,7.4074074074074066,305,310,305,0,-5,"Damian","Green","Conservative","Hold","Damian","Green","Conservative",3500,500,"Same MP","Damian Green",null,"Not Manufacturing Dependent",9.433962264150944,9.4,9.4,285,{"$f":"VLOOKUP(B24,'2022emp'!$A$2:$B$633,2,FALSE)","v":4500},{"$f":"VLOOKUP(B24,'2022emp'!$A$2:$F$633,4,FALSE)","v":58000},{"$f":"VLOOKUP(B24,'2022emp'!$A$2:$H$633,7,FALSE)","v":3500},{"$f":"VLOOKUP(B24,'2022emp'!$A$2:$H$633,8,FALSE)","v":700},-25,7.7586206896551726,"Not Manufacturing Dependent",7.8]
["North West","Ashton-under-Lyne",3500,35000,10,200,220,220,-20,-20,"Angela","Rayner","Labour","Hold","Angela","Rayner","Labour",3000,600,"Same MP","Angela Rayner",null,"Manufacturing Dependent",11.428571428571429,11.4,11.4,200,{"$f":"VLOOKUP(B25,'2022emp'!$A$2:$B$633,2,FALSE)","v":3000},{"$f":"VLOOKUP(B25,'2022emp'!$A$2:$F$633,4,FALSE)","v":36000},{"$f":"VLOOKUP(B25,'2022emp'!$A$2:$H$633,7,FALSE)","v":3000},{"$f":"VLOOKUP(B25,'2022emp'!$A$2:$H$633,8,FALSE)","v":250},-20,8.3333333333333321,"Not Manufacturing Dependent",8.3000000000000007]
["South East","Aylesbury",2500,56000,4.4642857142857144,235,210,215,20,25,"Rob","Butler","Conservative","Hold","Rob","Butler","Conservative",2250,300,"Same MP","Rob Butler",null,"Not Manufacturing Dependent",5.7692307692307692,5.8,5.8,235,{"$f":"VLOOKUP(B26,'2022emp'!$A$2:$B$633,2,FALSE)","v":3000},{"$f":"VLOOKUP(B26,'2022emp'!$A$2:$F$633,4,FALSE)","v":58000},{"$f":"VLOOKUP(B26,'2022emp'!$A$2:$H$633,7,FALSE)","v":2500},{"$f":"VLOOKUP(B26,'2022emp'!$A$2:$H$633,8,FALSE)","v":300},25,5.1724137931034484,"Not Manufacturing Dependent",5.2]
["Scotland","Ayr, Carrick and Cumnock",1500,31000,4.838709677419355,145,150,160,-15,-5,"Allan","Dorans","Scottish National Party","Hold","Allan","Dorans","Scottish National Party",1250,150,"Same MP","Allan Dorans",null,"Not Manufacturing Dependent",4.5454545454545459,4.5,4.5,125,{"$f":"VLOOKUP(B27,'2022emp'!$A$2:$B$633,2,FALSE)","v":1750},{"$f":"VLOOKUP(B27,'2022emp'!$A$2:$F$633,4,FALSE)","v":33000},{"$f":"VLOOKUP(B27,'2022emp'!$A$2:$H$633,7,FALSE)","v":1500},{"$f":"VLOOKUP(B27,'2022emp'!$A$2:$H$633,8,FALSE)","v":225},-25,5.3030303030303028,"Not Manufacturing Dependent",5.3]
["South East","Banbury",7000,70000,10,285,290,285,0,-5,"Victoria","Prentis","Conservative","Hold","Victoria","Prentis","Conservative",7000,800,"Same MP","Victoria Prentis",null,"Manufacturing Dependent",11.111111111111111,11.1,11.1,290,{"$f":"VLOOKUP(B28,'2022emp'!$A$2:$B$633,2,FALSE)","v":7000},{"$f":"VLOOKUP(B28,'2022emp'!$A$2:$F$633,4,FALSE)","v":68000},{"$f":"VLOOKUP(B28,'2022emp'!$A$2:$H$633,7,FALSE)","v":6000},{"$f":"VLOOKUP(B28,'2022emp'!$A$2:$H$633,8,FALSE)","v":600},0,10.294117647058822,"Manufacturing Dependent",10.3]
["Scotland","Banff and Buchan",7000,34000,20.588235294117645,315,310,320,-5,5,"David","Duguid","Conservative","Hold","David","Duguid","Conservative",6000,900,"Same MP","David Duguid",null,"Very Manufacturing Dependent",17.647058823529413,17.600000000000001,17.600000000000001,290,{"$f":"VLOOKUP(B29,'2022emp'!$A$2:$B$633,2,FALSE)","v":6000},{"$f":"VLOOKUP(B29,'2022emp'!$A$2:$F$633,4,FALSE)","v":34000},{"$f":"VLOOKUP(B29,'2022emp'!$A$2:$H$633,7,FALSE)","v":5000},{"$f":"VLOOKUP(B29,'2022emp'!$A$2:$H$633,8,FALSE)","v":800},-20,17.647058823529413,"Manufacturing Dependent",17.600000000000001]
["London","Barking",1750,38000,4.6052631578947363,180,160,160,20,20,"Margaret","Hodge","Labour","Hold","Margaret","Hodge","Labour",1500,300,"Same MP","Margaret Hodge",null,"Not Manufacturing Dependent",4.1666666666666661,4.2,4.2,200,{"$f":"VLOOKUP(B30,'2022emp'!$A$2:$B$633,2,FALSE)","v":1750},{"$f":"VLOOKUP(B30,'2022emp'!$A$2:$F$633,4,FALSE)","v":39000},{"$f":"VLOOKUP(B30,'2022emp'!$A$2:$H$633,7,FALSE)","v":1500},{"$f":"VLOOKUP(B30,'2022emp'!$A$2:$H$633,8,FALSE)","v":350},40,4.4871794871794872,"Not Manufacturing Dependent",4.5]
["Yorkshire & the Humber","Barnsley Central",4000,40000,10,185,185,185,0,0,"Dan","Jarvis","Labour","Hold","Dan","Jarvis","Labour",4000,400,"Same MP","Dan Jarvis",null,"Manufacturing Dependent",10,10,10,180,{"$f":"VLOOKUP(B31,'2022emp'!$A$2:$B$633,2,FALSE)","v":4500},{"$f":"VLOOKUP(B31,'2022emp'!$A$2:$F$633,4,FALSE)","v":42000},{"$f":"VLOOKUP(B31,'2022emp'!$A$2:$H$633,7,FALSE)","v":4000},{"$f":"VLOOKUP(B31,'2022emp'!$A$2:$H$633,8,FALSE)","v":350},-5,10.714285714285714,"Manufacturing Dependent",10.7]
["Yorkshire & the Humber","Barnsley East",6000,24000,25,155,135,140,15,20,"Stephanie","Peacock","Labour","Hold","Stephanie","Peacock","Labour",5000,600,"Same MP","Stephanie Peacock",null,"Extremely Manufacturing Dependent",24,24,24,140,{"$f":"VLOOKUP(B32,'2022emp'!$A$2:$B$633,2,FALSE)","v":6000},{"$f":"VLOOKUP(B32,'2022emp'!$A$2:$F$633,4,FALSE)","v":25000},{"$f":"VLOOKUP(B32,'2022emp'!$A$2:$H$633,7,FALSE)","v":5000},{"$f":"VLOOKUP(B32,'2022emp'!$A$2:$H$633,8,FALSE)","v":400},5,24,"Very Manufacturing Dependent",24]
["North West","Barrow and Furness",11000,37000,29.72972972972973,195,205,195,0,-10,"Simon","Fell","Conservative","Hold","Simon","Fell","Conservative",10000,600,"Same MP","Simon Fell",null,"Extremely Manufacturing Dependent",26.315789473684209,26.3,26.3,150,{"$f":"VLOOKUP(B33,'2022emp'!$A$2:$B$633,2,FALSE)","v":12000},{"$f":"VLOOKUP(B33,'2022emp'!$A$2:$F$633,4,FALSE)","v":38000},{"$f":"VLOOKUP(B33,'2022emp'!$A$2:$H$633,7,FALSE)","v":11000},{"$f":"VLOOKUP(B33,'2022emp'!$A$2:$H$633,8,FALSE)","v":450},-55,31.578947368421051,"Extremely Manufacturing Dependent",31.6]
["Eastern","Basildon and Billericay",3500,54000,6.481481481481481,240,255,255,-15,-15,"John","Baron","Conservative","Hold","John","Baron","Conservative",3000,300,"Same MP","John Baron",null,"Not Manufacturing Dependent",8.1818181818181817,8.1999999999999993,8.1999999999999993,240,{"$f":"VLOOKUP(B34,'2022emp'!$A$2:$B$633,2,FALSE)","v":7000},{"$f":"VLOOKUP(B34,'2022emp'!$A$2:$F$633,4,FALSE)","v":58000},{"$f":"VLOOKUP(B34,'2022emp'!$A$2:$H$633,7,FALSE)","v":6000},{"$f":"VLOOKUP(B34,'2022emp'!$A$2:$H$633,8,FALSE)","v":500},-15,12.068965517241379,"Manufacturing Dependent",12.1]
["South East","Basingstoke",3500,67000,5.2238805970149249,195,190,190,5,5,"Maria","Miller","Conservative","Hold","Maria","Miller","Conservative",3000,400,"Same MP","Maria Miller",null,"Not Manufacturing Dependent",5.7971014492753623,5.8,5.8,170,{"$f":"VLOOKUP(B35,'2022emp'!$A$2:$B$633,2,FALSE)","v":3000},{"$f":"VLOOKUP(B35,'2022emp'!$A$2:$F$633,4,FALSE)","v":67000},{"$f":"VLOOKUP(B35,'2022emp'!$A$2:$H$633,7,FALSE)","v":3000},{"$f":"VLOOKUP(B35,'2022emp'!$A$2:$H$633,8,FALSE)","v":400},-20,4.4776119402985071,"Not Manufacturing Dependent",4.5]
["East Midlands","Bassetlaw",8000,42000,19.047619047619047,250,265,270,-20,-15,"Brendan","Clarke-Smith","Conservative","Hold","Brendan","Clarke-Smith","Conservative",8000,800,"Same MP","Brendan Clarke-Smith",null,"Very Manufacturing Dependent",18.604651162790699,18.600000000000001,18.600000000000001,265,{"$f":"VLOOKUP(B36,'2022emp'!$A$2:$B$633,2,FALSE)","v":8000},{"$f":"VLOOKUP(B36,'2022emp'!$A$2:$F$633,4,FALSE)","v":44000},{"$f":"VLOOKUP(B36,'2022emp'!$A$2:$H$633,7,FALSE)","v":7000},{"$f":"VLOOKUP(B36,'2022emp'!$A$2:$H$633,8,FALSE)","v":900},0,18.181818181818183,"Very Manufacturing Dependent",18.2]
["South West","Bath",1500,58000,2.5862068965517242,135,120,125,10,15,"Wera","Hobhouse","Liberal Democrat","Hold","Wera","Hobhouse","Liberal Democrat",1500,125,"Same MP","Wera Hobhouse",null,"Not Manufacturing Dependent",2.6315789473684208,2.6,2.6,130,{"$f":"VLOOKUP(B37,'2022emp'!$A$2:$B$633,2,FALSE)","v":1250},{"$f":"VLOOKUP(B37,'2022emp'!$A$2:$F$633,4,FALSE)","v":60000},{"$f":"VLOOKUP(B37,'2022emp'!$A$2:$H$633,7,FALSE)","v":1000},{"$f":"VLOOKUP(B37,'2022emp'!$A$2:$H$633,8,FALSE)","v":250},10,2.083333333333333,"Not Manufacturing Dependent",2.1]
["Yorkshire & the Humber","Batley and Spen",8000,41000,19.512195121951219,425,380,385,40,45,"Kim","Leadbeater","Labour","Change","Tracy","Brabin","Labour/Co-operative",7000,900,"New MP","Kim Leadbeater",null,"Very Manufacturing Dependent",19.047619047619047,19,19,440,{"$f":"VLOOKUP(B38,'2022emp'!$A$2:$B$633,2,FALSE)","v":9000},{"$f":"VLOOKUP(B38,'2022emp'!$A$2:$F$633,4,FALSE)","v":43000},{"$f":"VLOOKUP(B38,'2022emp'!$A$2:$H$633,7,FALSE)","v":8000},{"$f":"VLOOKUP(B38,'2022emp'!$A$2:$H$633,8,FALSE)","v":1000},60,20.930232558139537,"Very Manufacturing Dependent",20.9]
["London","Battersea",1000,45000,2.2222222222222223,215,205,195,20,10,"Marsha","de Cordova","Labour","Hold","Marsha","de Cordova","Labour",700,250,"Same MP","Marsha de Cordova",null,"Not Manufacturing Dependent",2.1276595744680851,2.1,2.1,205,{"$f":"VLOOKUP(B39,'2022emp'!$A$2:$B$633,2,FALSE)","v":1000},{"$f":"VLOOKUP(B39,'2022emp'!$A$2:$F$633,4,FALSE)","v":50000},{"$f":"VLOOKUP(B39,'2022emp'!$A$2:$H$633,7,FALSE)","v":900},{"$f":"VLOOKUP(B39,'2022emp'!$A$2:$H$633,8,FALSE)","v":150},0,2,"Not Manufacturing Dependent",2]
["South East","Beaconsfield",3500,58000,6.0344827586206895,255,250,245,10,5,"Joy","Morrissey","Conservative","Hold","Joy","Morrissey","Conservative",3000,400,"Same MP","Joy Morrissey",null,"Not Manufacturing Dependent",5.2631578947368416,5.3,5.3,250,{"$f":"VLOOKUP(B40,'2022emp'!$A$2:$B$633,2,FALSE)","v":3000},{"$f":"VLOOKUP(B40,'2022emp'!$A$2:$F$633,4,FALSE)","v":61000},{"$f":"VLOOKUP(B40,'2022emp'!$A$2:$H$633,7,FALSE)","v":2500},{"$f":"VLOOKUP(B40,'2022emp'!$A$2:$H$633,8,FALSE)","v":400},0,4.918032786885246,"Not Manufacturing Dependent",4.9000000000000004]
["London","Beckenham",400,22000,1.8181818181818181,110,115,110,0,-5,"Bob","Stewart","Conservative","Hold","Bob","Stewart","Conservative",350,75,"Same MP","Bob Stewart",null,"Not Manufacturing Dependent",1.5217391304347827,1.5,1.5,120,{"$f":"VLOOKUP(B41,'2022emp'!$A$2:$B$633,2,FALSE)","v":400},{"$f":"VLOOKUP(B41,'2022emp'!$A$2:$F$633,4,FALSE)","v":24000},{"$f":"VLOOKUP(B41,'2022emp'!$A$2:$H$633,7,FALSE)","v":350},{"$f":"VLOOKUP(B41,'2022emp'!$A$2:$H$633,8,FALSE)","v":50},5,1.6666666666666667,"Not Manufacturing Dependent",1.7]
["Eastern","Bedford",4000,58000,6.8965517241379306,230,210,215,15,20,"Mohammad","Yasin","Labour","Hold","Mohammad","Yasin","Labour",3500,350,"Same MP","Mohammad Yasin",null,"Not Manufacturing Dependent",8.0357142857142865,8,8,235,{"$f":"VLOOKUP(B42,'2022emp'!$A$2:$B$633,2,FALSE)","v":4500},{"$f":"VLOOKUP(B42,'2022emp'!$A$2:$F$633,4,FALSE)","v":57000},{"$f":"VLOOKUP(B42,'2022emp'!$A$2:$H$633,7,FALSE)","v":4000},{"$f":"VLOOKUP(B42,'2022emp'!$A$2:$H$633,8,FALSE)","v":400},25,7.8947368421052628,"Not Manufacturing Dependent",7.9]
["Northern Ireland","Belfast East",null,null,{"$error":"#DIV/0!"},160,175,175,-15,-15,"Gavin","Robinson","DUP","Hold","Gavin","Robinson","DUP",null,null,"Same MP","Gavin Robinson",null,{"$error":"#DIV/0!"},11.16174371362688,11.2,11.2,140,{"$f":"VLOOKUP(B43,'2022emp'!$A$2:$B$633,2,FALSE)","v":{"$error":"#N/A"}},{"$f":"VLOOKUP(B43,'2022emp'!$A$2:$F$633,4,FALSE)","v":{"$error":"#N/A"}},{"$f":"VLOOKUP(B43,'2022emp'!$A$2:$H$633,7,FALSE)","v":{"$error":"#N/A"}},{"$f":"VLOOKUP(B43,'2022emp'!$A$2:$H$633,8,FALSE)","v":{"$error":"#N/A"}},-35,null,"Not Manufacturing Dependent",0]
["Northern Ireland","Belfast North",null,null,{"$error":"#DIV/0!"},125,135,130,-5,-10,"John","Finucane","Sinn Fein","Hold","John","Finucane","Sinn Fein",null,null,"Same MP","John Finucane",null,{"$error":"#DIV/0!"},3.1537506953656558,3.2,3.2,115,{"$f":"VLOOKUP(B44,'2022emp'!$A$2:$B$633,2,FALSE)","v":{"$error":"#N/A"}},{"$f":"VLOOKUP(B44,'2022emp'!$A$2:$F$633,4,FALSE)","v":{"$error":"#N/A"}},{"$f":"VLOOKUP(B44,'2022emp'!$A$2:$H$633,7,FALSE)","v":{"$error":"#N/A"}},{"$f":"VLOOKUP(B44,'2022emp'!$A$2:$H$633,8,FALSE)","v":{"$error":"#N/A"}},-20,null,"Not Manufacturing Dependent",0]
["Northern Ireland","Belfast South",null,null,{"$error":"#DIV/0!"},160,130,145,15,30,"Claire","Hanna","Social Democratic and Labour Party","Hold","Claire","Hanna","Social Democratic and Labour Party",null,null,"Same MP","Claire Hanna",null,{"$error":"#DIV/0!"},1.3104225553687072,1.3,1.3,150,{"$f":"VLOOKUP(B45,'2022emp'!$A$2:$B$633,2,FALSE)","v":{"$error":"#N/A"}},{"$f":"VLOOKUP(B45,'2022emp'!$A$2:$F$633,4,FALSE)","v":{"$error":"#N/A"}},{"$f":"VLOOKUP(B45,'2022emp'!$A$2:$H$633,7,FALSE)","v":{"$error":"#N/A"}},{"$f":"VLOOKUP(B45,'2022emp'!$A$2:$H$633,8,FALSE)","v":{"$error":"#N/A"}},20,null,"Not Manufacturing Dependent",0]
["Northern Ireland","Belfast West",null,null,{"$error":"#DIV/0!"},110,100,105,5,10,"Paul","Maskey","Sinn Fein","Hold","Paul","Maskey","Sinn Fein",null,null,"Same MP","Paul Maskey",null,{"$error":"#DIV/0!"},4.3626503436426116,4.4000000000000004,4.4000000000000004,100,{"$f":"VLOOKUP(B46,'2022emp'!$A$2:$B$633,2,FALSE)","v":{"$error":"#N/A"}},{"$f":"VLOOKUP(B46,'2022emp'!$A$2:$F$633,4,FALSE)","v":{"$error":"#N/A"}},{"$f":"VLOOKUP(B46,'2022emp'!$A$2:$H$633,7,FALSE)","v":{"$error":"#N/A"}},{"$f":"VLOOKUP(B46,'2022emp'!$A$2:$H$633,8,FALSE)","v":{"$error":"#N/A"}},0,null,"Not Manufacturing Dependent",0]
["London","Bermondsey and Old Southwark",2000,200000,1,265,255,280,-15,10,"Neil","Coyle","Labour","Hold","Neil","Coyle","Labour",1500,250,"Same MP","Neil Coyle",null,"Not Manufacturing Dependent",0.87939698492462315,0.9,0.9,250,{"$f":"VLOOKUP(B47,'2022emp'!$A$2:$B$633,2,FALSE)","v":1750},{"$f":"VLOOKUP(B47,'2022emp'!$A$2:$F$633,4,FALSE)","v":245000},{"$f":"VLOOKUP(B47,'2022emp'!$A$2:$H$633,7,FALSE)","v":1500},{"$f":"VLOOKUP(B47,'2022emp'!$A$2:$H$633,8,FALSE)","v":225},-5,0.7142857142857143,"Not Manufacturing Dependent",0.7]
["Scotland","Berwickshire, Roxburgh and Selkirk",4500,35000,12.857142857142856,225,215,235,-10,10,"John","Lamont","Conservative","Hold","John","Lamont","Conservative",4000,500,"Same MP","John Lamont",null,"Manufacturing Dependent",12.5,12.5,12.5,220,{"$f":"VLOOKUP(B48,'2022emp'!$A$2:$B$633,2,FALSE)","v":3500},{"$f":"VLOOKUP(B48,'2022emp'!$A$2:$F$633,4,FALSE)","v":36000},{"$f":"VLOOKUP(B48,'2022emp'!$A$2:$H$633,7,FALSE)","v":3500},{"$f":"VLOOKUP(B48,'2022emp'!$A$2:$H$633,8,FALSE)","v":450},5,9.7222222222222232,"Manufacturing Dependent",9.6999999999999993]
["North East","Berwick-upon-Tweed",1250,23000,5.4347826086956523,160,155,150,10,5,"Anne-Marie","Trevelyan","Conservative","Hold","Anne-Marie","Trevelyan","Conservative",1250,100,"Same MP","Anne-Marie Trevelyan",null,"Not Manufacturing Dependent",6.5217391304347823,6.5,6.5,150,{"$f":"VLOOKUP(B49,'2022emp'!$A$2:$B$633,2,FALSE)","v":1250},{"$f":"VLOOKUP(B49,'2022emp'!$A$2:$F$633,4,FALSE)","v":22000},{"$f":"VLOOKUP(B49,'2022emp'!$A$2:$H$633,7,FALSE)","v":1250},{"$f":"VLOOKUP(B49,'2022emp'!$A$2:$H$633,8,FALSE)","v":175},-5,5.6818181818181817,"Not Manufacturing Dependent",5.7]
["London","Bethnal Green and Bow",1250,101000,1.2376237623762376,280,345,280,0,-65,"Rushanara","Ali","Labour","Hold","Rushanara","Ali","Labour",1000,300,"Same MP","Rushanara Ali",null,"Not Manufacturing Dependent",1.2135922330097086,1.2,1.2,275,{"$f":"VLOOKUP(B50,'2022emp'!$A$2:$B$633,2,FALSE)","v":1250},{"$f":"VLOOKUP(B50,'2022emp'!$A$2:$F$633,4,FALSE)","v":104000},{"$f":"VLOOKUP(B50,'2022emp'!$A$2:$H$633,7,FALSE)","v":1000},{"$f":"VLOOKUP(B50,'2022emp'!$A$2:$H$633,8,FALSE)","v":250},-70,1.2019230769230771,"Not Manufacturing Dependent",1.2]
["Yorkshire & the Humber","Beverley and Holderness",4500,33000,13.636363636363635,235,240,230,5,-5,"Graham","Stuart","Conservative","Hold","Graham","Stuart","Conservative",4000,250,"Same MP","Graham Stuart",null,"Manufacturing Dependent",13.23529411764706,13.2,13.2,240,{"$f":"VLOOKUP(B51,'2022emp'!$A$2:$B$633,2,FALSE)","v":5000},{"$f":"VLOOKUP(B51,'2022emp'!$A$2:$F$633,4,FALSE)","v":35000},{"$f":"VLOOKUP(B51,'2022emp'!$A$2:$H$633,7,FALSE)","v":5000},{"$f":"VLOOKUP(B51,'2022emp'!$A$2:$H$633,8,FALSE)","v":300},0,14.285714285714285,"Manufacturing Dependent",14.3]
["South East","Bexhill and Battle",1500,29000,5.1724137931034484,235,225,235,0,10,"Huw","Merriman","Conservative","Hold","Huw","Merriman","Conservative",1250,200,"Same MP","Huw Merriman",null,"Not Manufacturing Dependent",5,5,5,235,{"$f":"VLOOKUP(B52,'2022emp'!$A$2:$B$633,2,FALSE)","v":1500},{"$f":"VLOOKUP(B52,'2022emp'!$A$2:$F$633,4,FALSE)","v":30000},{"$f":"VLOOKUP(B52,'2022emp'!$A$2:$H$633,7,FALSE)","v":1250},{"$f":"VLOOKUP(B52,'2022emp'!$A$2:$H$633,8,FALSE)","v":250},10,5,"Not Manufacturing Dependent",5]
["London","Bexleyheath and Crayford",1750,29000,6.0344827586206895,160,165,160,0,-5,"David","Evennett","Conservative","Hold","David","Evennett","Conservative",1500,175,"Same MP","David Evennett",null,"Not Manufacturing Dependent",4.4642857142857144,4.5,4.5,140,{"$f":"VLOOKUP(B53,'2022emp'!$A$2:$B$633,2,FALSE)","v":1250},{"$f":"VLOOKUP(B53,'2022emp'!$A$2:$F$633,4,FALSE)","v":29000},{"$f":"VLOOKUP(B53,'2022emp'!$A$2:$H$633,7,FALSE)","v":1250},{"$f":"VLOOKUP(B53,'2022emp'!$A$2:$H$633,8,FALSE)","v":125},-25,4.3103448275862073,"Not Manufacturing Dependent",4.3]
["North West","Birkenhead",3000,33000,9.0909090909090917,170,160,160,10,10,"Mick","Whitley","Labour","Hold","Mick","Whitley","Labour",3000,300,"Same MP","Mick Whitley",null,"Manufacturing Dependent",7.1428571428571423,7.1,7.1,165,{"$f":"VLOOKUP(B54,'2022emp'!$A$2:$B$633,2,FALSE)","v":3000},{"$f":"VLOOKUP(B54,'2022emp'!$A$2:$F$633,4,FALSE)","v":35000},{"$f":"VLOOKUP(B54,'2022emp'!$A$2:$H$633,7,FALSE)","v":2500},{"$f":"VLOOKUP(B54,'2022emp'!$A$2:$H$633,8,FALSE)","v":300},5,8.5714285714285712,"Not Manufacturing Dependent",8.6]
["West Midlands","Birmingham, Edgbaston",2000,68000,2.9411764705882351,90,90,105,-15,0,"Preet Kaur","Gill","Labour/Co-operative","Hold","Preet Kaur","Gill","Labour/Co-operative",1750,225,"Same MP","Preet Kaur Gill",null,"Not Manufacturing Dependent",3.4482758620689653,3.4,3.4,100,{"$f":"VLOOKUP(B55,'2022emp'!$A$2:$B$633,2,FALSE)","v":1750},{"$f":"VLOOKUP(B55,'2022emp'!$A$2:$F$633,4,FALSE)","v":72000},{"$f":"VLOOKUP(B55,'2022emp'!$A$2:$H$633,7,FALSE)","v":1500},{"$f":"VLOOKUP(B55,'2022emp'!$A$2:$H$633,8,FALSE)","v":250},10,2.4305555555555558,"Not Manufacturing Dependent",2.4]
["West Midlands","Birmingham, Erdington",4500,33000,13.636363636363635,125,120,125,0,5,"Paulette","Hamilton","Labour","Hold","Jack","Dromey","Labour",4500,175,"New MP","Paulette Hamilton",null,"Manufacturing Dependent",17.142857142857142,17.100000000000001,17.100000000000001,125,{"$f":"VLOOKUP(B56,'2022emp'!$A$2:$B$633,2,FALSE)","v":3500},{"$f":"VLOOKUP(B56,'2022emp'!$A$2:$F$633,4,FALSE)","v":33000},{"$f":"VLOOKUP(B56,'2022emp'!$A$2:$H$633,7,FALSE)","v":3000},{"$f":"VLOOKUP(B56,'2022emp'!$A$2:$H$633,8,FALSE)","v":300},5,10.606060606060606,"Manufacturing Dependent",10.6]
["West Midlands","Birmingham, Hall Green",1500,25000,6,185,190,180,5,-5,"Tahir","Ali","Labour","Hold","Tahir","Ali","Labour",1250,175,"Same MP","Tahir Ali",null,"Not Manufacturing Dependent",7.0000000000000009,7,7,175,{"$f":"VLOOKUP(B57,'2022emp'!$A$2:$B$633,2,FALSE)","v":1750},{"$f":"VLOOKUP(B57,'2022emp'!$A$2:$F$633,4,FALSE)","v":26000},{"$f":"VLOOKUP(B57,'2022emp'!$A$2:$H$633,7,FALSE)","v":1250},{"$f":"VLOOKUP(B57,'2022emp'!$A$2:$H$633,8,FALSE)","v":350},-15,6.7307692307692308,"Not Manufacturing Dependent",6.7]
["West Midlands","Birmingham, Hodge Hill",1750,27000,6.481481481481481,105,105,110,-5,0,"Liam","Byrne","Labour","Hold","Liam","Byrne","Labour",1500,100,"Same MP","Liam Byrne",null,"Not Manufacturing Dependent",7.4074074074074066,7.4,7.4,105,{"$f":"VLOOKUP(B58,'2022emp'!$A$2:$B$633,2,FALSE)","v":2000},{"$f":"VLOOKUP(B58,'2022emp'!$A$2:$F$633,4,FALSE)","v":27000},{"$f":"VLOOKUP(B58,'2022emp'!$A$2:$H$633,7,FALSE)","v":1750},{"$f":"VLOOKUP(B58,'2022emp'!$A$2:$H$633,8,FALSE)","v":250},0,7.4074074074074066,"Not Manufacturing Dependent",7.4]
["West Midlands","Birmingham, Ladywood",11000,220000,5,800,980,835,-35,-180,"Shabana","Mahmood","Labour","Hold","Shabana","Mahmood","Labour",9000,1250,"Same MP","Shabana Mahmood",null,"Not Manufacturing Dependent",5.8558558558558556,5.9,5.9,775,{"$f":"VLOOKUP(B59,'2022emp'!$A$2:$B$633,2,FALSE)","v":12000},{"$f":"VLOOKUP(B59,'2022emp'!$A$2:$F$633,4,FALSE)","v":241000},{"$f":"VLOOKUP(B59,'2022emp'!$A$2:$H$633,7,FALSE)","v":10000},{"$f":"VLOOKUP(B59,'2022emp'!$A$2:$H$633,8,FALSE)","v":1750},-205,4.9792531120331951,"Not Manufacturing Dependent",5]
["West Midlands","Birmingham, Northfield",1500,23000,6.5217391304347823,100,85,90,10,15,"Gary","Sambrook","Conservative","Hold","Gary","Sambrook","Conservative",1250,300,"Same MP","Gary Sambrook",null,"Not Manufacturing Dependent",6.5217391304347823,6.5,6.5,85,{"$f":"VLOOKUP(B60,'2022emp'!$A$2:$B$633,2,FALSE)","v":1500},{"$f":"VLOOKUP(B60,'2022emp'!$A$2:$F$633,4,FALSE)","v":25000},{"$f":"VLOOKUP(B60,'2022emp'!$A$2:$H$633,7,FALSE)","v":1250},{"$f":"VLOOKUP(B60,'2022emp'!$A$2:$H$633,8,FALSE)","v":225},0,6,"Not Manufacturing Dependent",6]
["West Midlands","Birmingham, Perry Barr",3500,27000,12.962962962962962,235,225,210,25,10,"Khalid","Mahmood","Labour","Hold","Khalid","Mahmood","Labour",3500,225,"Same MP","Khalid Mahmood",null,"Manufacturing Dependent",12.962962962962962,13,13,215,{"$f":"VLOOKUP(B61,'2022emp'!$A$2:$B$633,2,FALSE)","v":3000},{"$f":"VLOOKUP(B61,'2022emp'!$A$2:$F$633,4,FALSE)","v":27000},{"$f":"VLOOKUP(B61,'2022emp'!$A$2:$H$633,7,FALSE)","v":3000},{"$f":"VLOOKUP(B61,'2022emp'!$A$2:$H$633,8,FALSE)","v":400},-10,11.111111111111111,"Manufacturing Dependent",11.1]
["West Midlands","Birmingham, Selly Oak",1250,24000,5.2083333333333339,95,95,100,-5,0,"Steve","McCabe","Labour","Hold","Steve","McCabe","Labour",1250,100,"Same MP","Steve McCabe",null,"Not Manufacturing Dependent",3.8095238095238098,3.8,3.8,100,{"$f":"VLOOKUP(B62,'2022emp'!$A$2:$B$633,2,FALSE)","v":1250},{"$f":"VLOOKUP(B62,'2022emp'!$A$2:$F$633,4,FALSE)","v":24000},{"$f":"VLOOKUP(B62,'2022emp'!$A$2:$H$633,7,FALSE)","v":1250},{"$f":"VLOOKUP(B62,'2022emp'!$A$2:$H$633,8,FALSE)","v":175},5,5.2083333333333339,"Not Manufacturing Dependent",5.2]
["West Midlands","Birmingham, Yardley",4500,32000,14.0625,240,245,245,-5,-5,"Jess","Phillips","Labour","Hold","Jess","Phillips","Labour",4000,400,"Same MP","Jess Phillips",null,"Manufacturing Dependent",14.285714285714285,14.3,14.3,235,{"$f":"VLOOKUP(B63,'2022emp'!$A$2:$B$633,2,FALSE)","v":4500},{"$f":"VLOOKUP(B63,'2022emp'!$A$2:$F$633,4,FALSE)","v":33000},{"$f":"VLOOKUP(B63,'2022emp'!$A$2:$H$633,7,FALSE)","v":4000},{"$f":"VLOOKUP(B63,'2022emp'!$A$2:$H$633,8,FALSE)","v":600},-10,13.636363636363635,"Manufacturing Dependent",13.6]
["North East","Bishop Auckland",4500,29000,15.517241379310345,205,225,220,-15,-20,"Dehenna","Davison","Conservative","Hold","Dehenna","Davison","Conservative",4500,150,"Same MP","Dehenna Davison",null,"Manufacturing Dependent",15,15,15,220,{"$f":"VLOOKUP(B64,'2022emp'!$A$2:$B$633,2,FALSE)","v":4500},{"$f":"VLOOKUP(B64,'2022emp'!$A$2:$F$633,4,FALSE)","v":30000},{"$f":"VLOOKUP(B64,'2022emp'!$A$2:$H$633,7,FALSE)","v":4500},{"$f":"VLOOKUP(B64,'2022emp'!$A$2:$H$633,8,FALSE)","v":225},-5,15,"Manufacturing Dependent",15]
["North West","Blackburn",8000,56000,14.285714285714285,330,320,320,10,10,"Kate","Hollern","Labour","Hold","Kate","Hollern","Labour",7000,1250,"Same MP","Kate Hollern",null,"Manufacturing Dependent",13.559322033898304,13.6,13.6,340,{"$f":"VLOOKUP(B65,'2022emp'!$A$2:$B$633,2,FALSE)","v":7000},{"$f":"VLOOKUP(B65,'2022emp'!$A$2:$F$633,4,FALSE)","v":60000},{"$f":"VLOOKUP(B65,'2022emp'!$A$2:$H$633,7,FALSE)","v":6000},{"$f":"VLOOKUP(B65,'2022emp'!$A$2:$H$633,8,FALSE)","v":1000},20,11.666666666666666,"Manufacturing Dependent",11.7]
["North West","Blackley and Broughton",2500,45000,5.5555555555555554,175,160,160,15,15,"Graham","Stringer","Labour","Hold","Graham","Stringer","Labour",2000,400,"Same MP","Graham Stringer",null,"Not Manufacturing Dependent",3.4090909090909087,3.4,3.4,150,{"$f":"VLOOKUP(B66,'2022emp'!$A$2:$B$633,2,FALSE)","v":1500},{"$f":"VLOOKUP(B66,'2022emp'!$A$2:$F$633,4,FALSE)","v":45000},{"$f":"VLOOKUP(B66,'2022emp'!$A$2:$H$633,7,FALSE)","v":1250},{"$f":"VLOOKUP(B66,'2022emp'!$A$2:$H$633,8,FALSE)","v":250},-10,3.3333333333333335,"Not Manufacturing Dependent",3.3]
["North West","Blackpool North and Cleveleys",2250,33000,6.8181818181818175,135,130,125,10,5,"Paul","Maynard","Conservative","Hold","Paul","Maynard","Conservative",2000,225,"Same MP","Paul Maynard",null,"Not Manufacturing Dependent",7.2580645161290329,7.3,7.3,120,{"$f":"VLOOKUP(B67,'2022emp'!$A$2:$B$633,2,FALSE)","v":2250},{"$f":"VLOOKUP(B67,'2022emp'!$A$2:$F$633,4,FALSE)","v":31000},{"$f":"VLOOKUP(B67,'2022emp'!$A$2:$H$633,7,FALSE)","v":2000},{"$f":"VLOOKUP(B67,'2022emp'!$A$2:$H$633,8,FALSE)","v":200},-10,7.2580645161290329,"Not Manufacturing Dependent",7.3]
["North West","Blackpool South",3000,37000,8.1081081081081088,150,125,130,20,25,"Scott","Benton","Independent","Change","Scott","Lloyd Benton","Conservative",2500,250,"New MP","Scott Benton",null,"Manufacturing Dependent",6.5789473684210522,6.6,6.6,160,{"$f":"VLOOKUP(B68,'2022emp'!$A$2:$B$633,2,FALSE)","v":3000},{"$f":"VLOOKUP(B68,'2022emp'!$A$2:$F$633,4,FALSE)","v":39000},{"$f":"VLOOKUP(B68,'2022emp'!$A$2:$H$633,7,FALSE)","v":3000},{"$f":"VLOOKUP(B68,'2022emp'!$A$2:$H$633,8,FALSE)","v":250},35,7.6923076923076925,"Not Manufacturing Dependent",7.7]
["Wales","Blaenau Gwent",4000,17000,23.52941176470588,125,115,110,15,10,"Nick","Smith","Labour","Hold","Nick","Smith","Labour",3500,225,"Same MP","Nick Smith",null,"Very Manufacturing Dependent",22.222222222222221,22.2,22.2,115,{"$f":"VLOOKUP(B69,'2022emp'!$A$2:$B$633,2,FALSE)","v":4500},{"$f":"VLOOKUP(B69,'2022emp'!$A$2:$F$633,4,FALSE)","v":22000},{"$f":"VLOOKUP(B69,'2022emp'!$A$2:$H$633,7,FALSE)","v":4500},{"$f":"VLOOKUP(B69,'2022emp'!$A$2:$H$633,8,FALSE)","v":300},0,20.454545454545457,"Very Manufacturing Dependent",20.5]
["North East","Blaydon",3500,30000,11.666666666666666,165,170,170,-5,-5,"Liz","Twist","Labour","Hold","Liz","Twist","Labour",3000,150,"Same MP","Liz Twist",null,"Manufacturing Dependent",12.857142857142856,12.9,12.9,155,{"$f":"VLOOKUP(B70,'2022emp'!$A$2:$B$633,2,FALSE)","v":3500},{"$f":"VLOOKUP(B70,'2022emp'!$A$2:$F$633,4,FALSE)","v":28000},{"$f":"VLOOKUP(B70,'2022emp'!$A$2:$H$633,7,FALSE)","v":3500},{"$f":"VLOOKUP(B70,'2022emp'!$A$2:$H$633,8,FALSE)","v":225},-15,12.5,"Manufacturing Dependent",12.5]
["North East","Blyth Valley",5000,27000,18.518518518518519,185,180,185,0,5,"Ian","Levy","Conservative","Hold","Ian","Levy","Conservative",5000,225,"Same MP","Ian Levy",null,"Very Manufacturing Dependent",21.428571428571427,21.4,21.4,170,{"$f":"VLOOKUP(B71,'2022emp'!$A$2:$B$633,2,FALSE)","v":6000},{"$f":"VLOOKUP(B71,'2022emp'!$A$2:$F$633,4,FALSE)","v":29000},{"$f":"VLOOKUP(B71,'2022emp'!$A$2:$H$633,7,FALSE)","v":5000},{"$f":"VLOOKUP(B71,'2022emp'!$A$2:$H$633,8,FALSE)","v":350},-10,20.689655172413794,"Very Manufacturing Dependent",20.7]
["South East","Bognor Regis and Littlehampton",2250,30000,7.5,235,230,225,10,5,"Nick","Gibb","Conservative","Hold","Nick","Gibb","Conservative",1750,300,"Same MP","Nick Gibb",null,"Not Manufacturing Dependent",7.8125,7.8,7.8,220,{"$f":"VLOOKUP(B72,'2022emp'!$A$2:$B$633,2,FALSE)","v":2250},{"$f":"VLOOKUP(B72,'2022emp'!$A$2:$F$633,4,FALSE)","v":31000},{"$f":"VLOOKUP(B72,'2022emp'!$A$2:$H$633,7,FALSE)","v":2000},{"$f":"VLOOKUP(B72,'2022emp'!$A$2:$H$633,8,FALSE)","v":300},-10,7.2580645161290329,"Not Manufacturing Dependent",7.3]
["East Midlands","Bolsover",6000,34000,17.647058823529413,255,230,225,{"$f":"F73-H73","v":30},{"$f":"F73-G73","v":25},"Mark","Fletcher","Conservative","Hold","Mark","Fletcher","Conservative",6000,600,"Same MP",{"$f":"CONCATENATE(K73,\" \",L73)","v":"Mark Fletcher"},null,{"$f":"IF(E73>24.29, \"Extremely Manufacturing Dependent\", IF(E73>16.59, \"Very Manufacturing Dependent\", IF(E73>8.09, \"Manufacturing Dependent\", \"Not Manufacturing Dependent\")))","v":"Very Manufacturing Dependent"},14.705882352941178,14.7,14.7,245,{"$f":"VLOOKUP(B73,'2022emp'!$A$2:$B$633,2,FALSE)","v":6000},{"$f":"VLOOKUP(B73,'2022emp'!$A$2:$F$633,4,FALSE)","v":38000},{"$f":"VLOOKUP(B73,'2022emp'!$A$2:$H$633,7,FALSE)","v":5000},{"$f":"VLOOKUP(B73,'2022emp'!$A$2:$H$633,8,FALSE)","v":600},15,15.789473684210526,"Manufacturing Dependent",15.8]
["North West","Bolton North East",3500,36000,9.7222222222222232,260,255,270,-10,5,"Mark","Logan","Conservative",{"$f":"IF(M74=Q74, \"Hold\", \"Change\")","v":"Hold"},"Mark","Logan","Conservative",3000,400,{"$f":"IF(L74=P74, \"Same MP\", \"New MP\")","v":"Same MP"},"Mark Logan",null,"Manufacturing Dependent",9.7222222222222232,{"$f":"ROUND(X74,1)","v":9.6999999999999993},9.6999999999999993,220,{"$f":"VLOOKUP(B74,'2022emp'!$A$2:$B$633,2,FALSE)","v":3000},{"$f":"VLOOKUP(B74,'2022emp'!$A$2:$F$633,4,FALSE)","v":37000},{"$f":"VLOOKUP(B74,'2022emp'!$A$2:$H$633,7,FALSE)","v":2500},{"$f":"VLOOKUP(B74,'2022emp'!$A$2:$H$633,8,FALSE)","v":350},{"$f":"AA74-G74","v":-35},{"$f":"(AB74/AC74)*100","v":8.1081081081081088},{"$f":"IF(AG74>26.79, \"Extremely Manufacturing Dependent\", IF(AG74>17.86, \"Very Manufacturing Dependent\", IF(AG74>8.93, \"Manufacturing Dependent\", \"Not Manufacturing Dependent\")))","v":"Not Manufacturing Dependent"},{"$f":"ROUND(AG74,1)","v":8.1}]
["North West","Bolton South East",5000,46000,{"$f":"(C75/D75)*100","v":10.869565217391305},240,250,235,5,-10,"Yasmin","Qureshi","Labour","Hold","Yasmin","Qureshi","Labour",4500,600,"Same MP","Yasmin Qureshi",null,"Manufacturing Dependent",10.714285714285714,10.7,10.7,235,{"$f":"VLOOKUP(B75,'2022emp'!$A$2:$B$633,2,FALSE)","v":5000},{"$f":"VLOOKUP(B75,'2022emp'!$A$2:$F$633,4,FALSE)","v":47000},{"$f":"VLOOKUP(B75,'2022emp'!$A$2:$H$633,7,FALSE)","v":4500},{"$f":"VLOOKUP(B75,'2022emp'!$A$2:$H$633,8,FALSE)","v":500},-15,10.638297872340425,"Manufacturing Dependent",10.6]
["North West","Bolton West",5000,36000,13.888888888888889,205,200,215,-10,5,"Chris","Green","Conservative","Hold","Chris","Green","Conservative",5000,700,"Same MP","Chris Green",null,"Manufacturing Dependent",16.216216216216218,16.2,16.2,205,{"$f":"VLOOKUP(B76,'2022emp'!$A$2:$B$633,2,FALSE)","v":5000},{"$f":"VLOOKUP(B76,'2022emp'!$A$2:$F$633,4,FALSE)","v":38000},{"$f":"VLOOKUP(B76,'2022emp'!$A$2:$H$633,7,FALSE)","v":5000},{"$f":"VLOOKUP(B76,'2022emp'!$A$2:$H$633,8,FALSE)","v":300},5,13.157894736842104,"Manufacturing Dependent",13.2]
["North West","Bootle",3000,41000,7.3170731707317067,180,180,180,0,0,"Peter","Dowd","Labour","Hold","Peter","Dowd","Labour",2500,350,"Same MP","Peter Dowd",null,"Not Manufacturing Dependent",6.4102564102564097,6.4,6.4,175,{"$f":"VLOOKUP(B77,'2022emp'!$A$2:$B$633,2,FALSE)","v":3000},{"$f":"VLOOKUP(B77,'2022emp'!$A$2:$F$633,4,FALSE)","v":39000},{"$f":"VLOOKUP(B77,'2022emp'!$A$2:$H$633,7,FALSE)","v":2500},{"$f":"VLOOKUP(B77,'2022emp'!$A$2:$H$633,8,FALSE)","v":300},-5,7.6923076923076925,"Not Manufacturing Dependent",7.7]
["East Midlands","Boston and Skegness",5000,42000,11.904761904761903,210,210,210,0,0,"Matt","Warman","Conservative","Hold","Matt","Warman","Conservative",4000,600,"Same MP","Matt Warman",null,"Manufacturing Dependent",11.111111111111111,11.1,11.1,250,{"$f":"VLOOKUP(B78,'2022emp'!$A$2:$B$633,2,FALSE)","v":4500},{"$f":"VLOOKUP(B78,'2022emp'!$A$2:$F$633,4,FALSE)","v":44000},{"$f":"VLOOKUP(B78,'2022emp'!$A$2:$H$633,7,FALSE)","v":4500},{"$f":"VLOOKUP(B78,'2022emp'!$A$2:$H$633,8,FALSE)","v":400},40,10.227272727272728,"Manufacturing Dependent",10.199999999999999]
["East Midlands","Bosworth",6000,40000,15,405,400,390,15,5,"Luke","Evans","Conservative","Hold","Luke","Evans","Conservative",5000,400,"Same MP","Luke Evans",null,"Manufacturing Dependent",17.5,17.5,17.5,370,{"$f":"VLOOKUP(B79,'2022emp'!$A$2:$B$633,2,FALSE)","v":6000},{"$f":"VLOOKUP(B79,'2022emp'!$A$2:$F$633,4,FALSE)","v":41000},{"$f":"VLOOKUP(B79,'2022emp'!$A$2:$H$633,7,FALSE)","v":5000},{"$f":"VLOOKUP(B79,'2022emp'!$A$2:$H$633,8,FALSE)","v":450},-30,14.634146341463413,"Manufacturing Dependent",14.6]
["South West","Bournemouth East",400,38000,1.0526315789473684,145,135,130,15,10,"Tobias","Ellwood","Conservative","Hold","Tobias","Ellwood","Conservative",350,50,"Same MP","Tobias Ellwood",null,"Not Manufacturing Dependent",0.92105263157894723,0.9,0.9,130,{"$f":"VLOOKUP(B80,'2022emp'!$A$2:$B$633,2,FALSE)","v":350},{"$f":"VLOOKUP(B80,'2022emp'!$A$2:$F$633,4,FALSE)","v":40000},{"$f":"VLOOKUP(B80,'2022emp'!$A$2:$H$633,7,FALSE)","v":300},{"$f":"VLOOKUP(B80,'2022emp'!$A$2:$H$633,8,FALSE)","v":50},-5,0.87500000000000011,"Not Manufacturing Dependent",0.9]
["South West","Bournemouth West",1750,61000,2.8688524590163933,165,160,165,0,5,"Conor","Burns","Conservative","Hold","Conor","Burns","Conservative",1750,150,"Same MP","Conor Burns",null,"Not Manufacturing Dependent",2.8688524590163933,2.9,2.9,160,{"$f":"VLOOKUP(B81,'2022emp'!$A$2:$B$633,2,FALSE)","v":2000},{"$f":"VLOOKUP(B81,'2022emp'!$A$2:$F$633,4,FALSE)","v":60000},{"$f":"VLOOKUP(B81,'2022emp'!$A$2:$H$633,7,FALSE)","v":1750},{"$f":"VLOOKUP(B81,'2022emp'!$A$2:$H$633,8,FALSE)","v":175},0,3.3333333333333335,"Not Manufacturing Dependent",3.3]
["South East","Bracknell",1500,51000,2.9411764705882351,160,160,160,0,0,"James","Sunderland","Conservative","Hold","James","Sunderland","Conservative",1250,125,"Same MP","James Sunderland",null,"Not Manufacturing Dependent",2.8846153846153846,2.9,2.9,155,{"$f":"VLOOKUP(B82,'2022emp'!$A$2:$B$633,2,FALSE)","v":1750},{"$f":"VLOOKUP(B82,'2022emp'!$A$2:$F$633,4,FALSE)","v":51000},{"$f":"VLOOKUP(B82,'2022emp'!$A$2:$H$633,7,FALSE)","v":1500},{"$f":"VLOOKUP(B82,'2022emp'!$A$2:$H$633,8,FALSE)","v":150},-5,3.4313725490196081,"Not Manufacturing Dependent",3.4]
["Yorkshire & the Humber","Bradford East",4000,35000,11.428571428571429,260,250,250,10,10,"Imran","Hussain","Labour","Hold","Imran","Hussain","Labour",4000,350,"Same MP","Imran Hussain",null,"Manufacturing Dependent",13.513513513513514,13.5,13.5,285,{"$f":"VLOOKUP(B83,'2022emp'!$A$2:$B$633,2,FALSE)","v":4000},{"$f":"VLOOKUP(B83,'2022emp'!$A$2:$F$633,4,FALSE)","v":36000},{"$f":"VLOOKUP(B83,'2022emp'!$A$2:$H$633,7,FALSE)","v":4000},{"$f":"VLOOKUP(B83,'2022emp'!$A$2:$H$633,8,FALSE)","v":350},35,11.111111111111111,"Manufacturing Dependent",11.1]
["Yorkshire & the Humber","Bradford South",7000,36000,19.444444444444446,205,195,190,15,10,"Judith","Cummins","Labour","Hold","Judith","Cummins","Labour",6000,500,"Same MP","Judith Cummins",null,"Very Manufacturing Dependent",24.324324324324326,24.3,24.3,200,{"$f":"VLOOKUP(B84,'2022emp'!$A$2:$B$633,2,FALSE)","v":7000},{"$f":"VLOOKUP(B84,'2022emp'!$A$2:$F$633,4,FALSE)","v":38000},{"$f":"VLOOKUP(B84,'2022emp'!$A$2:$H$633,7,FALSE)","v":6000},{"$f":"VLOOKUP(B84,'2022emp'!$A$2:$H$633,8,FALSE)","v":500},5,18.421052631578945,"Very Manufacturing Dependent",18.399999999999999]
["Yorkshire & the Humber","Bradford West",5000,59000,8.4745762711864394,215,225,220,-5,-10,"Naseem","Shah","Labour","Hold","Naseem","Shah","Labour",4500,700,"Same MP","Naseem Shah",null,"Manufacturing Dependent",8.3333333333333321,8.3000000000000007,8.3000000000000007,275,{"$f":"VLOOKUP(B85,'2022emp'!$A$2:$B$633,2,FALSE)","v":5000},{"$f":"VLOOKUP(B85,'2022emp'!$A$2:$F$633,4,FALSE)","v":67000},{"$f":"VLOOKUP(B85,'2022emp'!$A$2:$H$633,7,FALSE)","v":4000},{"$f":"VLOOKUP(B85,'2022emp'!$A$2:$H$633,8,FALSE)","v":600},50,7.4626865671641784,"Not Manufacturing Dependent",7.5]
["Eastern","Braintree",3000,35000,8.5714285714285712,350,360,355,-5,-10,"James","Cleverly","Conservative","Hold","James","Cleverly","Conservative",3000,400,"Same MP","James Cleverly",null,"Manufacturing Dependent",11.428571428571429,11.4,11.4,350,{"$f":"VLOOKUP(B86,'2022emp'!$A$2:$B$633,2,FALSE)","v":3500},{"$f":"VLOOKUP(B86,'2022emp'!$A$2:$F$633,4,FALSE)","v":34000},{"$f":"VLOOKUP(B86,'2022emp'!$A$2:$H$633,7,FALSE)","v":3000},{"$f":"VLOOKUP(B86,'2022emp'!$A$2:$H$633,8,FALSE)","v":400},-10,10.294117647058822,"Manufacturing Dependent",10.3]
["Wales","Brecon and Radnorshire",1750,23000,7.608695652173914,185,180,175,10,5,"Fay","Jones","Conservative","Hold","Fay Alicia","Jones","Conservative",1500,150,"Same MP","Fay Jones",null,"Not Manufacturing Dependent",7.0000000000000009,7,7,180,{"$f":"VLOOKUP(B87,'2022emp'!$A$2:$B$633,2,FALSE)","v":1750},{"$f":"VLOOKUP(B87,'2022emp'!$A$2:$F$633,4,FALSE)","v":25000},{"$f":"VLOOKUP(B87,'2022emp'!$A$2:$H$633,7,FALSE)","v":1750},{"$f":"VLOOKUP(B87,'2022emp'!$A$2:$H$633,8,FALSE)","v":150},0,7.0000000000000009,"Not Manufacturing Dependent",7]
["London","Brent Central",7000,59000,11.864406779661017,280,275,260,20,5,"Dawn","Butler","Labour","Hold","Dawn","Butler","Labour",6000,800,"Same MP","Dawn Butler",null,"Manufacturing Dependent",9.67741935483871,9.6999999999999993,9.6999999999999993,285,{"$f":"VLOOKUP(B88,'2022emp'!$A$2:$B$633,2,FALSE)","v":7000},{"$f":"VLOOKUP(B88,'2022emp'!$A$2:$F$633,4,FALSE)","v":60000},{"$f":"VLOOKUP(B88,'2022emp'!$A$2:$H$633,7,FALSE)","v":6000},{"$f":"VLOOKUP(B88,'2022emp'!$A$2:$H$633,8,FALSE)","v":700},10,11.666666666666666,"Manufacturing Dependent",11.7]
["London","Brent North",1750,50000,3.5000000000000004,170,180,175,-5,-10,"Barry","Gardiner","Labour","Hold","Barry","Gardiner","Labour",1500,175,"Same MP","Barry Gardiner",null,"Not Manufacturing Dependent",2.9411764705882351,2.9,2.9,185,{"$f":"VLOOKUP(B89,'2022emp'!$A$2:$B$633,2,FALSE)","v":2000},{"$f":"VLOOKUP(B89,'2022emp'!$A$2:$F$633,4,FALSE)","v":51000},{"$f":"VLOOKUP(B89,'2022emp'!$A$2:$H$633,7,FALSE)","v":1750},{"$f":"VLOOKUP(B89,'2022emp'!$A$2:$H$633,8,FALSE)","v":175},5,3.9215686274509802,"Not Manufacturing Dependent",3.9]
["London","Brentford and Isleworth",1250,102000,1.2254901960784315,225,210,210,15,15,"Ruth","Cadbury","Labour","Hold","Ruth","Cadbury","Labour",1000,200,"Same MP","Ruth Cadbury",null,"Not Manufacturing Dependent",1.4285714285714286,1.4,1.4,210,{"$f":"VLOOKUP(B90,'2022emp'!$A$2:$B$633,2,FALSE)","v":1750},{"$f":"VLOOKUP(B90,'2022emp'!$A$2:$F$633,4,FALSE)","v":110000},{"$f":"VLOOKUP(B90,'2022emp'!$A$2:$H$633,7,FALSE)","v":1500},{"$f":"VLOOKUP(B90,'2022emp'!$A$2:$H$633,8,FALSE)","v":150},0,1.5909090909090908,"Not Manufacturing Dependent",1.6]
["Eastern","Brentwood and Ongar",2000,42000,4.7619047619047619,270,265,275,-5,5,"Alex","Burghart","Conservative","Hold","Alex","Burghart","Conservative",1750,225,"Same MP","Alex Burghart",null,"Not Manufacturing Dependent",4.6511627906976747,4.7,4.7,255,{"$f":"VLOOKUP(B91,'2022emp'!$A$2:$B$633,2,FALSE)","v":1500},{"$f":"VLOOKUP(B91,'2022emp'!$A$2:$F$633,4,FALSE)","v":41000},{"$f":"VLOOKUP(B91,'2022emp'!$A$2:$H$633,7,FALSE)","v":1250},{"$f":"VLOOKUP(B91,'2022emp'!$A$2:$H$633,8,FALSE)","v":225},-10,3.6585365853658534,"Not Manufacturing Dependent",3.7]
["Wales","Bridgend",5000,39000,12.820512820512819,325,320,305,20,5,"Jamie","Wallis","Conservative","Hold","Jamie Hamilton","Wallis","Conservative",5000,225,"Same MP","Jamie Wallis",null,"Manufacturing Dependent",13.953488372093023,14,14,220,{"$f":"VLOOKUP(B92,'2022emp'!$A$2:$B$633,2,FALSE)","v":3500},{"$f":"VLOOKUP(B92,'2022emp'!$A$2:$F$633,4,FALSE)","v":40000},{"$f":"VLOOKUP(B92,'2022emp'!$A$2:$H$633,7,FALSE)","v":3500},{"$f":"VLOOKUP(B92,'2022emp'!$A$2:$H$633,8,FALSE)","v":200},-100,8.75,"Not Manufacturing Dependent",8.8000000000000007]
["South West","Bridgwater and West Somerset",4500,43000,10.465116279069768,235,240,245,-10,-5,"Ian","Liddell-Grainger","Conservative","Hold","Ian","Liddell-Grainger","Conservative",4000,500,"Same MP","Ian Liddell-Grainger",null,"Manufacturing Dependent",10.465116279069768,10.5,10.5,225,{"$f":"VLOOKUP(B93,'2022emp'!$A$2:$B$633,2,FALSE)","v":5000},{"$f":"VLOOKUP(B93,'2022emp'!$A$2:$F$633,4,FALSE)","v":48000},{"$f":"VLOOKUP(B93,'2022emp'!$A$2:$H$633,7,FALSE)","v":4500},{"$f":"VLOOKUP(B93,'2022emp'!$A$2:$H$633,8,FALSE)","v":400},-15,10.416666666666668,"Manufacturing Dependent",10.4]
["Yorkshire & the Humber","Brigg and Goole",4000,29000,13.793103448275861,220,195,205,15,25,"Andrew","Percy","Conservative","Hold","Andrew","Percy","Conservative",3500,250,"Same MP","Andrew Percy",null,"Manufacturing Dependent",12.903225806451612,12.9,12.9,200,{"$f":"VLOOKUP(B94,'2022emp'!$A$2:$B$633,2,FALSE)","v":4500},{"$f":"VLOOKUP(B94,'2022emp'!$A$2:$F$633,4,FALSE)","v":29000},{"$f":"VLOOKUP(B94,'2022emp'!$A$2:$H$633,7,FALSE)","v":4000},{"$f":"VLOOKUP(B94,'2022emp'!$A$2:$H$633,8,FALSE)","v":500},5,15.517241379310345,"Manufacturing Dependent",15.5]
["South East","Brighton, Kemptown",600,34000,1.7647058823529411,95,90,90,5,5,"Lloyd","Russell-Moyle","Labour/Co-operative","Hold","Lloyd","Russell-Moyle","Labour/Co-operative",500,75,"Same MP","Lloyd Russell-Moyle",null,"Not Manufacturing Dependent",1.7647058823529411,1.8,1.8,95,{"$f":"VLOOKUP(B95,'2022emp'!$A$2:$B$633,2,FALSE)","v":600},{"$f":"VLOOKUP(B95,'2022emp'!$A$2:$F$633,4,FALSE)","v":38000},{"$f":"VLOOKUP(B95,'2022emp'!$A$2:$H$633,7,FALSE)","v":500},{"$f":"VLOOKUP(B95,'2022emp'!$A$2:$H$633,8,FALSE)","v":75},5,1.5789473684210527,"Not Manufacturing Dependent",1.6]
["South East","Brighton, Pavilion",1000,68000,1.4705882352941175,175,170,185,-10,5,"Caroline","Lucas","Green","Hold","Caroline","Lucas","Green",900,150,"Same MP","Caroline Lucas",null,"Not Manufacturing Dependent",1.3043478260869565,1.3,1.3,170,{"$f":"VLOOKUP(B96,'2022emp'!$A$2:$B$633,2,FALSE)","v":1250},{"$f":"VLOOKUP(B96,'2022emp'!$A$2:$F$633,4,FALSE)","v":72000},{"$f":"VLOOKUP(B96,'2022emp'!$A$2:$H$633,7,FALSE)","v":900},{"$f":"VLOOKUP(B96,'2022emp'!$A$2:$H$633,8,FALSE)","v":200},0,1.7361111111111112,"Not Manufacturing Dependent",1.7]
["South West","Bristol East",2500,29000,8.6206896551724146,205,210,190,15,-5,"Kerry","McCarthy","Labour","Hold","Kerry","McCarthy","Labour",2500,225,"Same MP","Kerry McCarthy",null,"Manufacturing Dependent",10.714285714285714,10.7,10.7,205,{"$f":"VLOOKUP(B97,'2022emp'!$A$2:$B$633,2,FALSE)","v":2500},{"$f":"VLOOKUP(B97,'2022emp'!$A$2:$F$633,4,FALSE)","v":29000},{"$f":"VLOOKUP(B97,'2022emp'!$A$2:$H$633,7,FALSE)","v":2250},{"$f":"VLOOKUP(B97,'2022emp'!$A$2:$H$633,8,FALSE)","v":300},-5,8.6206896551724146,"Not Manufacturing Dependent",8.6]
["South West","Bristol North West",1750,50000,3.5000000000000004,120,115,115,5,5,"Darren","Jones","Labour","Hold","Darren","Jones","Labour",1750,100,"Same MP","Darren Jones",null,"Not Manufacturing Dependent",4.0816326530612246,4.0999999999999996,4.0999999999999996,115,{"$f":"VLOOKUP(B98,'2022emp'!$A$2:$B$633,2,FALSE)","v":2000},{"$f":"VLOOKUP(B98,'2022emp'!$A$2:$F$633,4,FALSE)","v":53000},{"$f":"VLOOKUP(B98,'2022emp'!$A$2:$H$633,7,FALSE)","v":1750},{"$f":"VLOOKUP(B98,'2022emp'!$A$2:$H$633,8,FALSE)","v":150},0,3.7735849056603774,"Not Manufacturing Dependent",3.8]
["South West","Bristol South",3000,35000,8.5714285714285712,185,175,180,5,10,"Karin","Smyth","Labour","Hold","Karin","Smyth","Labour",3000,350,"Same MP","Karin Smyth",null,"Manufacturing Dependent",8.5714285714285712,8.6,8.6,170,{"$f":"VLOOKUP(B99,'2022emp'!$A$2:$B$633,2,FALSE)","v":3500},{"$f":"VLOOKUP(B99,'2022emp'!$A$2:$F$633,4,FALSE)","v":38000},{"$f":"VLOOKUP(B99,'2022emp'!$A$2:$H$633,7,FALSE)","v":3000},{"$f":"VLOOKUP(B99,'2022emp'!$A$2:$H$633,8,FALSE)","v":350},-5,9.2105263157894726,"Manufacturing Dependent",9.1999999999999993]
["South West","Bristol West",1750,167000,1.0479041916167664,300,300,300,0,0,"Thangam","Debbonaire","Labour","Hold","Thangam","Debbonaire","Labour",1500,175,"Same MP","Thangam Debbonaire",null,"Not Manufacturing Dependent",1.1217948717948718,1.1000000000000001,1.1000000000000001,280,{"$f":"VLOOKUP(B100,'2022emp'!$A$2:$B$633,2,FALSE)","v":2500},{"$f":"VLOOKUP(B100,'2022emp'!$A$2:$F$633,4,FALSE)","v":178000},{"$f":"VLOOKUP(B100,'2022emp'!$A$2:$H$633,7,FALSE)","v":2250},{"$f":"VLOOKUP(B100,'2022emp'!$A$2:$H$633,8,FALSE)","v":400},-20,1.4044943820224718,"Not Manufacturing Dependent",1.4]
["Eastern","Broadland",4500,32000,14.0625,325,310,315,10,15,"Jerome","Mayhew","Conservative","Hold","Jerome","Mayhew","Conservative",4500,350,"Same MP","Jerome Mayhew",null,"Manufacturing Dependent",14.516129032258066,14.5,14.5,305,{"$f":"VLOOKUP(B101,'2022emp'!$A$2:$B$633,2,FALSE)","v":4500},{"$f":"VLOOKUP(B101,'2022emp'!$A$2:$F$633,4,FALSE)","v":33000},{"$f":"VLOOKUP(B101,'2022emp'!$A$2:$H$633,7,FALSE)","v":4000},{"$f":"VLOOKUP(B101,'2022emp'!$A$2:$H$633,8,FALSE)","v":400},-5,13.636363636363635,"Manufacturing Dependent",13.6]
["London","Bromley and Chislehurst",500,41000,1.2195121951219512,105,115,105,0,-10,"Bob","Neill","Conservative","Hold","Bob","Neill","Conservative",450,100,"Same MP","Bob Neill",null,"Not Manufacturing Dependent",1,1,1,115,{"$f":"VLOOKUP(B102,'2022emp'!$A$2:$B$633,2,FALSE)","v":350},{"$f":"VLOOKUP(B102,'2022emp'!$A$2:$F$633,4,FALSE)","v":40000},{"$f":"VLOOKUP(B102,'2022emp'!$A$2:$H$633,7,FALSE)","v":300},{"$f":"VLOOKUP(B102,'2022emp'!$A$2:$H$633,8,FALSE)","v":75},0,0.87500000000000011,"Not Manufacturing Dependent",0.9]
["West Midlands","Bromsgrove",3000,50000,6,260,275,275,-15,-15,"Sajid","Javid","Conservative","Hold","Sajid","Javid","Conservative",2500,250,"Same MP","Sajid Javid",null,"Not Manufacturing Dependent",6.1224489795918364,6.1,6.1,260,{"$f":"VLOOKUP(B103,'2022emp'!$A$2:$B$633,2,FALSE)","v":3000},{"$f":"VLOOKUP(B103,'2022emp'!$A$2:$F$633,4,FALSE)","v":48000},{"$f":"VLOOKUP(B103,'2022emp'!$A$2:$H$633,7,FALSE)","v":2500},{"$f":"VLOOKUP(B103,'2022emp'!$A$2:$H$633,8,FALSE)","v":400},-15,6.25,"Not Manufacturing Dependent",6.3]
["Eastern","Broxbourne",2500,38000,6.5789473684210522,215,235,230,-15,-20,"Charles","Walker","Conservative","Hold","Charles","Walker","Conservative",2250,400,"Same MP","Charles Walker",null,"Not Manufacturing Dependent",8.3333333333333321,8.3000000000000007,8.3000000000000007,230,{"$f":"VLOOKUP(B104,'2022emp'!$A$2:$B$633,2,FALSE)","v":2500},{"$f":"VLOOKUP(B104,'2022emp'!$A$2:$F$633,4,FALSE)","v":37000},{"$f":"VLOOKUP(B104,'2022emp'!$A$2:$H$633,7,FALSE)","v":2250},{"$f":"VLOOKUP(B104,'2022emp'!$A$2:$H$633,8,FALSE)","v":350},-5,6.756756756756757,"Not Manufacturing Dependent",6.8]
["East Midlands","Broxtowe",3500,30000,11.666666666666666,170,155,155,15,15,"Darren","Henry","Conservative","Hold","Darren George","Henry","Conservative",3500,300,"Same MP","Darren Henry",null,"Manufacturing Dependent",14.0625,14.1,14.1,150,{"$f":"VLOOKUP(B105,'2022emp'!$A$2:$B$633,2,FALSE)","v":4000},{"$f":"VLOOKUP(B105,'2022emp'!$A$2:$F$633,4,FALSE)","v":32000},{"$f":"VLOOKUP(B105,'2022emp'!$A$2:$H$633,7,FALSE)","v":3500},{"$f":"VLOOKUP(B105,'2022emp'!$A$2:$H$633,8,FALSE)","v":250},-5,12.5,"Manufacturing Dependent",12.5]
["South East","Buckingham",5000,37000,13.513513513513514,395,375,385,10,20,"Greg","Smith","Conservative","Hold","Greg","Smith","Conservative",4000,600,"Same MP","Greg Smith",null,"Manufacturing Dependent",12.857142857142856,12.9,12.9,380,{"$f":"VLOOKUP(B106,'2022emp'!$A$2:$B$633,2,FALSE)","v":5000},{"$f":"VLOOKUP(B106,'2022emp'!$A$2:$F$633,4,FALSE)","v":38000},{"$f":"VLOOKUP(B106,'2022emp'!$A$2:$H$633,7,FALSE)","v":4500},{"$f":"VLOOKUP(B106,'2022emp'!$A$2:$H$633,8,FALSE)","v":500},5,13.157894736842104,"Manufacturing Dependent",13.2]
["North West","Burnley",8000,38000,21.052631578947366,260,250,260,0,10,"Antony","Higginbotham","Conservative","Hold","Antony","Higginbotham","Conservative",7000,600,"Same MP","Antony Higginbotham",null,"Very Manufacturing Dependent",17.948717948717949,17.899999999999999,17.899999999999999,245,{"$f":"VLOOKUP(B107,'2022emp'!$A$2:$B$633,2,FALSE)","v":6000},{"$f":"VLOOKUP(B107,'2022emp'!$A$2:$F$633,4,FALSE)","v":39000},{"$f":"VLOOKUP(B107,'2022emp'!$A$2:$H$633,7,FALSE)","v":5000},{"$f":"VLOOKUP(B107,'2022emp'!$A$2:$H$633,8,FALSE)","v":350},-5,15.384615384615385,"Manufacturing Dependent",15.4]
["West Midlands","Burton",7000,59000,11.864406779661017,280,260,260,20,20,"Kate","Kniveton","Conservative","Hold","Kate","Griffiths","Conservative",7000,500,"New MP","Kate Kniveton",null,"Manufacturing Dependent",16.071428571428573,16.100000000000001,16.100000000000001,265,{"$f":"VLOOKUP(B108,'2022emp'!$A$2:$B$633,2,FALSE)","v":11000},{"$f":"VLOOKUP(B108,'2022emp'!$A$2:$F$633,4,FALSE)","v":57000},{"$f":"VLOOKUP(B108,'2022emp'!$A$2:$H$633,7,FALSE)","v":9000},{"$f":"VLOOKUP(B108,'2022emp'!$A$2:$H$633,8,FALSE)","v":1500},5,19.298245614035086,"Very Manufacturing Dependent",19.3]
["North West","Bury North",3500,37000,9.4594594594594597,215,230,210,5,-15,"James","Daly","Conservative","Hold","James","Daly","Conservative",3000,300,"Same MP","James Daly",null,"Manufacturing Dependent",9.5238095238095237,9.5,9.5,200,{"$f":"VLOOKUP(B109,'2022emp'!$A$2:$B$633,2,FALSE)","v":3500},{"$f":"VLOOKUP(B109,'2022emp'!$A$2:$F$633,4,FALSE)","v":38000},{"$f":"VLOOKUP(B109,'2022emp'!$A$2:$H$633,7,FALSE)","v":3500},{"$f":"VLOOKUP(B109,'2022emp'!$A$2:$H$633,8,FALSE)","v":300},-30,9.2105263157894726,"Manufacturing Dependent",9.1999999999999993]
["North West","Bury South",3500,28000,12.5,180,190,190,-10,-10,"Christian","Wakeford","Labour","Change","Christian","Wakeford","Conservative",3000,300,"Same MP","Christian Wakeford",null,"Manufacturing Dependent",10.344827586206897,10.3,10.3,165,{"$f":"VLOOKUP(B110,'2022emp'!$A$2:$B$633,2,FALSE)","v":3500},{"$f":"VLOOKUP(B110,'2022emp'!$A$2:$F$633,4,FALSE)","v":31000},{"$f":"VLOOKUP(B110,'2022emp'!$A$2:$H$633,7,FALSE)","v":3500},{"$f":"VLOOKUP(B110,'2022emp'!$A$2:$H$633,8,FALSE)","v":400},-25,11.29032258064516,"Manufacturing Dependent",11.3]
["Eastern","Bury St Edmunds",5000,72000,6.9444444444444446,240,235,235,5,5,"Jo","Churchill","Conservative","Hold","Jo","Churchill","Conservative",4500,500,"Same MP","Jo Churchill",null,"Not Manufacturing Dependent",8.9552238805970141,9,9,245,{"$f":"VLOOKUP(B111,'2022emp'!$A$2:$B$633,2,FALSE)","v":5000},{"$f":"VLOOKUP(B111,'2022emp'!$A$2:$F$633,4,FALSE)","v":73000},{"$f":"VLOOKUP(B111,'2022emp'!$A$2:$H$633,7,FALSE)","v":5000},{"$f":"VLOOKUP(B111,'2022emp'!$A$2:$H$633,8,FALSE)","v":600},10,6.8493150684931505,"Not Manufacturing Dependent",6.8]
["Wales","Caerphilly",4500,31000,14.516129032258066,155,155,150,5,0,"Wayne","David","Labour","Hold","Wayne","David","Labour",4000,300,"Same MP","Wayne David",null,"Manufacturing Dependent",15,15,15,145,{"$f":"VLOOKUP(B112,'2022emp'!$A$2:$B$633,2,FALSE)","v":4500},{"$f":"VLOOKUP(B112,'2022emp'!$A$2:$F$633,4,FALSE)","v":31000},{"$f":"VLOOKUP(B112,'2022emp'!$A$2:$H$633,7,FALSE)","v":4500},{"$f":"VLOOKUP(B112,'2022emp'!$A$2:$H$633,8,FALSE)","v":300},-10,14.516129032258066,"Manufacturing Dependent",14.5]
["Scotland","Caithness, Sutherland and Easter Ross",1750,22000,7.9545454545454541,190,195,200,-10,-5,"Jamie","Stone","Liberal Democrat","Hold","Jamie","Stone","Liberal Democrat",1500,175,"Same MP","Jamie Stone",null,"Not Manufacturing Dependent",8.695652173913043,8.6999999999999993,8.6999999999999993,155,{"$f":"VLOOKUP(B113,'2022emp'!$A$2:$B$633,2,FALSE)","v":2000},{"$f":"VLOOKUP(B113,'2022emp'!$A$2:$F$633,4,FALSE)","v":23000},{"$f":"VLOOKUP(B113,'2022emp'!$A$2:$H$633,7,FALSE)","v":1750},{"$f":"VLOOKUP(B113,'2022emp'!$A$2:$H$633,8,FALSE)","v":175},-40,8.695652173913043,"Not Manufacturing Dependent",8.6999999999999993]
["Yorkshire & the Humber","Calder Valley",8000,44000,18.181818181818183,435,435,435,0,0,"Craig","Whittaker","Conservative","Hold","Craig","Whittaker","Conservative",7000,800,"Same MP","Craig Whittaker",null,"Very Manufacturing Dependent",20,20,20,430,{"$f":"VLOOKUP(B114,'2022emp'!$A$2:$B$633,2,FALSE)","v":8000},{"$f":"VLOOKUP(B114,'2022emp'!$A$2:$F$633,4,FALSE)","v":44000},{"$f":"VLOOKUP(B114,'2022emp'!$A$2:$H$633,7,FALSE)","v":7000},{"$f":"VLOOKUP(B114,'2022emp'!$A$2:$H$633,8,FALSE)","v":700},-5,18.181818181818183,"Very Manufacturing Dependent",18.2]
["London","Camberwell and Peckham",700,33000,2.1212121212121215,140,140,135,5,0,"Harriet","Harman","Labour","Hold","Harriet","Harman","Labour",600,150,"Same MP","Harriet Harman",null,"Not Manufacturing Dependent",2.4242424242424243,2.4,2.4,145,{"$f":"VLOOKUP(B115,'2022emp'!$A$2:$B$633,2,FALSE)","v":800},{"$f":"VLOOKUP(B115,'2022emp'!$A$2:$F$633,4,FALSE)","v":36000},{"$f":"VLOOKUP(B115,'2022emp'!$A$2:$H$633,7,FALSE)","v":600},{"$f":"VLOOKUP(B115,'2022emp'!$A$2:$H$633,8,FALSE)","v":175},5,2.2222222222222223,"Not Manufacturing Dependent",2.2000000000000002]
["South West","Camborne and Redruth",2500,31000,8.064516129032258,200,210,200,0,-10,"George","Eustice","Conservative","Hold","George","Eustice","Conservative",2500,200,"Same MP","George Eustice",null,"Not Manufacturing Dependent",8.064516129032258,8.1,8.1,230,{"$f":"VLOOKUP(B116,'2022emp'!$A$2:$B$633,2,FALSE)","v":3000},{"$f":"VLOOKUP(B116,'2022emp'!$A$2:$F$633,4,FALSE)","v":35000},{"$f":"VLOOKUP(B116,'2022emp'!$A$2:$H$633,7,FALSE)","v":3000},{"$f":"VLOOKUP(B116,'2022emp'!$A$2:$H$633,8,FALSE)","v":250},20,8.5714285714285712,"Not Manufacturing Dependent",8.6]
["Eastern","Cambridge",1500,101000,1.4851485148514851,175,170,190,-15,5,"Daniel","Zeichner","Labour","Hold","Daniel","Zeichner","Labour",1500,200,"Same MP","Daniel Zeichner",null,"Not Manufacturing Dependent",2.0348837209302326,2,2,165,{"$f":"VLOOKUP(B117,'2022emp'!$A$2:$B$633,2,FALSE)","v":1500},{"$f":"VLOOKUP(B117,'2022emp'!$A$2:$F$633,4,FALSE)","v":88000},{"$f":"VLOOKUP(B117,'2022emp'!$A$2:$H$633,7,FALSE)","v":1250},{"$f":"VLOOKUP(B117,'2022emp'!$A$2:$H$633,8,FALSE)","v":225},-5,1.7045454545454544,"Not Manufacturing Dependent",1.7]
["West Midlands","Cannock Chase",4000,39000,10.256410256410255,305,305,305,0,0,"Amanda","Milling","Conservative","Hold","Amanda","Milling","Conservative",3500,500,"Same MP","Amanda Milling",null,"Manufacturing Dependent",11.904761904761903,11.9,11.9,315,{"$f":"VLOOKUP(B118,'2022emp'!$A$2:$B$633,2,FALSE)","v":3500},{"$f":"VLOOKUP(B118,'2022emp'!$A$2:$F$633,4,FALSE)","v":41000},{"$f":"VLOOKUP(B118,'2022emp'!$A$2:$H$633,7,FALSE)","v":3000},{"$f":"VLOOKUP(B118,'2022emp'!$A$2:$H$633,8,FALSE)","v":450},10,8.536585365853659,"Not Manufacturing Dependent",8.5]
["South East","Canterbury",1500,54000,2.7777777777777777,180,170,175,5,10,"Rosie","Duffield","Labour","Hold","Rosie","Duffield","Labour",1500,200,"Same MP","Rosie Duffield",null,"Not Manufacturing Dependent",2.6785714285714284,2.7,2.7,165,{"$f":"VLOOKUP(B119,'2022emp'!$A$2:$B$633,2,FALSE)","v":1250},{"$f":"VLOOKUP(B119,'2022emp'!$A$2:$F$633,4,FALSE)","v":57000},{"$f":"VLOOKUP(B119,'2022emp'!$A$2:$H$633,7,FALSE)","v":1250},{"$f":"VLOOKUP(B119,'2022emp'!$A$2:$H$633,8,FALSE)","v":200},-5,2.1929824561403506,"Not Manufacturing Dependent",2.2000000000000002]
["Wales","Cardiff Central",900,70000,1.2857142857142856,80,80,80,0,0,"Jo","Stevens","Labour","Hold","Jo","Stevens","Labour",800,100,"Same MP","Jo Stevens",null,"Not Manufacturing Dependent",0.84507042253521114,0.8,0.8,95,{"$f":"VLOOKUP(B120,'2022emp'!$A$2:$B$633,2,FALSE)","v":900},{"$f":"VLOOKUP(B120,'2022emp'!$A$2:$F$633,4,FALSE)","v":78000},{"$f":"VLOOKUP(B120,'2022emp'!$A$2:$H$633,7,FALSE)","v":800},{"$f":"VLOOKUP(B120,'2022emp'!$A$2:$H$633,8,FALSE)","v":100},15,1.153846153846154,"Not Manufacturing Dependent",1.2]
["Wales","Cardiff North",2000,51000,3.9215686274509802,85,75,75,10,10,"Anna","McMorrin","Labour","Hold","Anna","McMorrin","Labour",2000,150,"Same MP","Anna McMorrin",null,"Not Manufacturing Dependent",4.0816326530612246,4.0999999999999996,4.0999999999999996,75,{"$f":"VLOOKUP(B121,'2022emp'!$A$2:$B$633,2,FALSE)","v":2500},{"$f":"VLOOKUP(B121,'2022emp'!$A$2:$F$633,4,FALSE)","v":49000},{"$f":"VLOOKUP(B121,'2022emp'!$A$2:$H$633,7,FALSE)","v":2000},{"$f":"VLOOKUP(B121,'2022emp'!$A$2:$H$633,8,FALSE)","v":450},0,5.1020408163265305,"Not Manufacturing Dependent",5.0999999999999996]
["Wales","Cardiff South and Penarth",5000,75000,6.666666666666667,230,220,215,15,10,"Stephen","Doughty","Labour/Co-operative","Hold","Stephen","Doughty","Labour/Co-operative",5000,400,"Same MP","Stephen Doughty",null,"Not Manufacturing Dependent",6.756756756756757,6.8,6.8,235,{"$f":"VLOOKUP(B122,'2022emp'!$A$2:$B$633,2,FALSE)","v":4500},{"$f":"VLOOKUP(B122,'2022emp'!$A$2:$F$633,4,FALSE)","v":77000},{"$f":"VLOOKUP(B122,'2022emp'!$A$2:$H$633,7,FALSE)","v":4000},{"$f":"VLOOKUP(B122,'2022emp'!$A$2:$H$633,8,FALSE)","v":300},15,5.8441558441558437,"Not Manufacturing Dependent",5.8]
["Wales","Cardiff West",1000,27000,3.7037037037037033,85,90,90,-5,-5,"Kevin","Brennan","Labour","Hold","Kevin","Brennan","Labour",1000,75,"Same MP","Kevin Brennan",null,"Not Manufacturing Dependent",3.5714285714285712,3.6,3.6,80,{"$f":"VLOOKUP(B123,'2022emp'!$A$2:$B$633,2,FALSE)","v":1250},{"$f":"VLOOKUP(B123,'2022emp'!$A$2:$F$633,4,FALSE)","v":29000},{"$f":"VLOOKUP(B123,'2022emp'!$A$2:$H$633,7,FALSE)","v":1000},{"$f":"VLOOKUP(B123,'2022emp'!$A$2:$H$633,8,FALSE)","v":125},-10,4.3103448275862073,"Not Manufacturing Dependent",4.3]
["North West","Carlisle",5000,44000,11.363636363636363,125,120,115,10,5,"John","Stevenson","Conservative","Hold","John","Stevenson","Conservative",4500,450,"Same MP","John Stevenson",null,"Manufacturing Dependent",11.111111111111111,11.1,11.1,140,{"$f":"VLOOKUP(B124,'2022emp'!$A$2:$B$633,2,FALSE)","v":4500},{"$f":"VLOOKUP(B124,'2022emp'!$A$2:$F$633,4,FALSE)","v":45000},{"$f":"VLOOKUP(B124,'2022emp'!$A$2:$H$633,7,FALSE)","v":4500},{"$f":"VLOOKUP(B124,'2022emp'!$A$2:$H$633,8,FALSE)","v":350},20,10,"Manufacturing Dependent",10]
["Wales","Carmarthen East and Dinefwr",2500,19000,13.157894736842104,195,185,185,10,10,"Jonathan","Edwards","Independent","Change","Jonathan","Edwards","Plaid Cymru",2500,300,"Same MP","Jonathan Edwards",null,"Manufacturing Dependent",12.5,12.5,12.5,200,{"$f":"VLOOKUP(B125,'2022emp'!$A$2:$B$633,2,FALSE)","v":3000},{"$f":"VLOOKUP(B125,'2022emp'!$A$2:$F$633,4,FALSE)","v":20000},{"$f":"VLOOKUP(B125,'2022emp'!$A$2:$H$633,7,FALSE)","v":2500},{"$f":"VLOOKUP(B125,'2022emp'!$A$2:$H$633,8,FALSE)","v":300},15,15,"Manufacturing Dependent",15]
["Wales","Carmarthen West and South Pembrokeshire",2500,35000,7.1428571428571423,195,175,195,0,20,"Simon","Hart","Conservative","Hold","Simon","Hart","Conservative",2250,125,"Same MP","Simon Hart",null,"Not Manufacturing Dependent",5.7142857142857144,5.7,5.7,195,{"$f":"VLOOKUP(B126,'2022emp'!$A$2:$B$633,2,FALSE)","v":1750},{"$f":"VLOOKUP(B126,'2022emp'!$A$2:$F$633,4,FALSE)","v":36000},{"$f":"VLOOKUP(B126,'2022emp'!$A$2:$H$633,7,FALSE)","v":1500},{"$f":"VLOOKUP(B126,'2022emp'!$A$2:$H$633,8,FALSE)","v":125},20,4.8611111111111116,"Not Manufacturing Dependent",4.9000000000000004]
["London","Carshalton and Wallington",1250,34000,3.6764705882352944,135,140,135,0,-5,"Elliot","Colburn","Conservative","Hold","Elliot","Colburn","Conservative",1000,175,"Same MP","Elliot Colburn",null,"Not Manufacturing Dependent",3.6764705882352944,3.7,3.7,130,{"$f":"VLOOKUP(B127,'2022emp'!$A$2:$B$633,2,FALSE)","v":1250},{"$f":"VLOOKUP(B127,'2022emp'!$A$2:$F$633,4,FALSE)","v":38000},{"$f":"VLOOKUP(B127,'2022emp'!$A$2:$H$633,7,FALSE)","v":1250},{"$f":"VLOOKUP(B127,'2022emp'!$A$2:$H$633,8,FALSE)","v":125},-10,3.2894736842105261,"Not Manufacturing Dependent",3.3]
["Eastern","Castle Point",1250,22000,5.6818181818181817,190,190,185,5,0,"Rebecca","Harris","Conservative","Hold","Rebecca","Harris","Conservative",1000,125,"Same MP","Rebecca Harris",null,"Not Manufacturing Dependent",7.1428571428571423,7.1,7.1,165,{"$f":"VLOOKUP(B128,'2022emp'!$A$2:$B$633,2,FALSE)","v":1500},{"$f":"VLOOKUP(B128,'2022emp'!$A$2:$F$633,4,FALSE)","v":22000},{"$f":"VLOOKUP(B128,'2022emp'!$A$2:$H$633,7,FALSE)","v":1250},{"$f":"VLOOKUP(B128,'2022emp'!$A$2:$H$633,8,FALSE)","v":225},-25,6.8181818181818175,"Not Manufacturing Dependent",6.8]
["Scotland","Central Ayrshire",6000,34000,17.647058823529413,155,160,175,-20,-5,"Philippa","Whitford","Scottish National Party","Hold","Philippa","Whitford","Scottish National Party",5000,300,"Same MP","Philippa Whitford",null,"Very Manufacturing Dependent",16.666666666666664,16.7,16.7,145,{"$f":"VLOOKUP(B129,'2022emp'!$A$2:$B$633,2,FALSE)","v":6000},{"$f":"VLOOKUP(B129,'2022emp'!$A$2:$F$633,4,FALSE)","v":37000},{"$f":"VLOOKUP(B129,'2022emp'!$A$2:$H$633,7,FALSE)","v":5000},{"$f":"VLOOKUP(B129,'2022emp'!$A$2:$H$633,8,FALSE)","v":1250},-15,16.216216216216218,"Manufacturing Dependent",16.2]
["South West","Central Devon",3000,29000,10.344827586206897,315,320,315,0,-5,"Mel","Stride","Conservative","Hold","Mel","Stride","Conservative",3000,250,"Same MP","Mel Stride",null,"Manufacturing Dependent",12.068965517241379,12.1,12.1,305,{"$f":"VLOOKUP(B130,'2022emp'!$A$2:$B$633,2,FALSE)","v":3500},{"$f":"VLOOKUP(B130,'2022emp'!$A$2:$F$633,4,FALSE)","v":30000},{"$f":"VLOOKUP(B130,'2022emp'!$A$2:$H$633,7,FALSE)","v":3000},{"$f":"VLOOKUP(B130,'2022emp'!$A$2:$H$633,8,FALSE)","v":350},-15,11.666666666666666,"Manufacturing Dependent",11.7]
["Eastern","Central Suffolk and North Ipswich",3500,34000,10.294117647058822,265,260,255,10,5,"Daniel","Poulter","Conservative","Hold","Daniel","Poulter","Conservative",3000,450,"Same MP","Daniel Poulter",null,"Manufacturing Dependent",11.111111111111111,11.1,11.1,290,{"$f":"VLOOKUP(B131,'2022emp'!$A$2:$B$633,2,FALSE)","v":3500},{"$f":"VLOOKUP(B131,'2022emp'!$A$2:$F$633,4,FALSE)","v":36000},{"$f":"VLOOKUP(B131,'2022emp'!$A$2:$H$633,7,FALSE)","v":3000},{"$f":"VLOOKUP(B131,'2022emp'!$A$2:$H$633,8,FALSE)","v":350},30,9.7222222222222232,"Manufacturing Dependent",9.6999999999999993]
["Wales","Ceredigion",1000,25000,4,165,155,155,10,10,"Ben","Lake","Plaid Cymru","Hold","Ben","Lake","Plaid Cymru",900,100,"Same MP","Ben Lake",null,"Not Manufacturing Dependent",4.8076923076923084,4.8,4.8,160,{"$f":"VLOOKUP(B132,'2022emp'!$A$2:$B$633,2,FALSE)","v":1000},{"$f":"VLOOKUP(B132,'2022emp'!$A$2:$F$633,4,FALSE)","v":27000},{"$f":"VLOOKUP(B132,'2022emp'!$A$2:$H$633,7,FALSE)","v":1000},{"$f":"VLOOKUP(B132,'2022emp'!$A$2:$H$633,8,FALSE)","v":100},5,3.7037037037037033,"Not Manufacturing Dependent",3.7]
["East Midlands","Charnwood",5000,33000,15.151515151515152,270,285,280,-10,-15,"Edward","Argar","Conservative","Hold","Edward","Argar","Conservative",4500,700,"Same MP","Edward Argar",null,"Manufacturing Dependent",15.151515151515152,15.2,15.2,265,{"$f":"VLOOKUP(B133,'2022emp'!$A$2:$B$633,2,FALSE)","v":6000},{"$f":"VLOOKUP(B133,'2022emp'!$A$2:$F$633,4,FALSE)","v":40000},{"$f":"VLOOKUP(B133,'2022emp'!$A$2:$H$633,7,FALSE)","v":5000},{"$f":"VLOOKUP(B133,'2022emp'!$A$2:$H$633,8,FALSE)","v":700},-20,15,"Manufacturing Dependent",15]
["South East","Chatham and Aylesford",2500,31000,8.064516129032258,160,150,145,15,10,"Tracey","Crouch","Conservative","Hold","Tracey","Crouch","Conservative",2250,225,"Same MP","Tracey Crouch",null,"Not Manufacturing Dependent",8.3333333333333321,8.3000000000000007,8.3000000000000007,160,{"$f":"VLOOKUP(B134,'2022emp'!$A$2:$B$633,2,FALSE)","v":2500},{"$f":"VLOOKUP(B134,'2022emp'!$A$2:$F$633,4,FALSE)","v":36000},{"$f":"VLOOKUP(B134,'2022emp'!$A$2:$H$633,7,FALSE)","v":2250},{"$f":"VLOOKUP(B134,'2022emp'!$A$2:$H$633,8,FALSE)","v":200},10,6.9444444444444446,"Not Manufacturing Dependent",6.9]
["North West","Cheadle",2500,43000,5.8139534883720927,175,180,180,-5,-5,"Mary","Robinson","Conservative","Hold","Mary","Robinson","Conservative",2250,250,"Same MP","Mary Robinson",null,"Not Manufacturing Dependent",5.6818181818181817,5.7,5.7,170,{"$f":"VLOOKUP(B135,'2022emp'!$A$2:$B$633,2,FALSE)","v":3000},{"$f":"VLOOKUP(B135,'2022emp'!$A$2:$F$633,4,FALSE)","v":51000},{"$f":"VLOOKUP(B135,'2022emp'!$A$2:$H$633,7,FALSE)","v":2500},{"$f":"VLOOKUP(B135,'2022emp'!$A$2:$H$633,8,FALSE)","v":225},-10,5.8823529411764701,"Not Manufacturing Dependent",5.9]
["Eastern","Chelmsford",2250,60000,3.75,155,160,150,5,-5,"Vicky","Ford","Conservative","Hold","Vicky","Ford","Conservative",2000,350,"Same MP","Vicky Ford",null,"Not Manufacturing Dependent",4.0983606557377046,4.0999999999999996,4.0999999999999996,155,{"$f":"VLOOKUP(B136,'2022emp'!$A$2:$B$633,2,FALSE)","v":2500},{"$f":"VLOOKUP(B136,'2022emp'!$A$2:$F$633,4,FALSE)","v":60000},{"$f":"VLOOKUP(B136,'2022emp'!$A$2:$H$633,7,FALSE)","v":2250},{"$f":"VLOOKUP(B136,'2022emp'!$A$2:$H$633,8,FALSE)","v":300},-5,4.1666666666666661,"Not Manufacturing Dependent",4.2]
["London","Chelsea and Fulham",700,66000,1.0606060606060608,220,220,225,{"$f":"F137-H137","v":-5},{"$f":"F137-G137","v":0},"Greg","Hands","Conservative","Hold","Greg","Hands","Conservative",500,175,"Same MP",{"$f":"CONCATENATE(K137,\" \",L137)","v":"Greg Hands"},null,{"$f":"IF(E137>24.29, \"Extremely Manufacturing Dependent\", IF(E137>16.59, \"Very Manufacturing Dependent\", IF(E137>8.09, \"Manufacturing Dependent\", \"Not Manufacturing Dependent\")))","v":"Not Manufacturing Dependent"},1.3235294117647058,1.3,1.3,195,{"$f":"VLOOKUP(B137,'2022emp'!$A$2:$B$633,2,FALSE)","v":800},{"$f":"VLOOKUP(B137,'2022emp'!$A$2:$F$633,4,FALSE)","v":69000},{"$f":"VLOOKUP(B137,'2022emp'!$A$2:$H$633,7,FALSE)","v":700},{"$f":"VLOOKUP(B137,'2022emp'!$A$2:$H$633,8,FALSE)","v":150},-25,1.1594202898550725,"Not Manufacturing Dependent",1.2]
["South West","Cheltenham",2500,53000,4.716981132075472,165,170,165,0,-5,"Alex","Chalk","Conservative",{"$f":"IF(M138=Q138, \"Hold\", \"Change\")","v":"Hold"},"Alex","Chalk","Conservative",2250,225,{"$f":"IF(L138=P138, \"Same MP\", \"New MP\")","v":"Same MP"},"Alex Chalk",null,"Not Manufacturing Dependent",4.6296296296296298,{"$f":"ROUND(X138,1)","v":4.5999999999999996},4.5999999999999996,150,{"$f":"VLOOKUP(B138,'2022emp'!$A$2:$B$633,2,FALSE)","v":2250},{"$f":"VLOOKUP(B138,'2022emp'!$A$2:$F$633,4,FALSE)","v":55000},{"$f":"VLOOKUP(B138,'2022emp'!$A$2:$H$633,7,FALSE)","v":2000},{"$f":"VLOOKUP(B138,'2022emp'!$A$2:$H$633,8,FALSE)","v":250},{"$f":"AA138-G138","v":-20},{"$f":"(AB138/AC138)*100","v":4.0909090909090908},{"$f":"IF(AG138>26.79, \"Extremely Manufacturing Dependent\", IF(AG138>17.86, \"Very Manufacturing Dependent\", IF(AG138>8.93, \"Manufacturing Dependent\", \"Not Manufacturing Dependent\")))","v":"Not Manufacturing Dependent"},{"$f":"ROUND(AG138,1)","v":4.0999999999999996}]
["South East","Chesham and Amersham",2000,34000,{"$f":"(C139/D139)*100","v":5.8823529411764701},210,220,210,0,-10,"Sarah","Green","Liberal Democrat","Change","Cheryl","Gillan","Conservative",1750,250,"New MP","Sarah Green",null,"Not Manufacturing Dependent",5.1470588235294112,5.0999999999999996,5.0999999999999996,215,{"$f":"VLOOKUP(B139,'2022emp'!$A$2:$B$633,2,FALSE)","v":2000},{"$f":"VLOOKUP(B139,'2022emp'!$A$2:$F$633,4,FALSE)","v":33000},{"$f":"VLOOKUP(B139,'2022emp'!$A$2:$H$633,7,FALSE)","v":1750},{"$f":"VLOOKUP(B139,'2022emp'!$A$2:$H$633,8,FALSE)","v":225},-5,6.0606060606060606,"Not Manufacturing Dependent",6.1]
["East Midlands","Chesterfield",4000,47000,8.5106382978723403,300,275,290,10,25,"Toby","Perkins","Labour","Hold","Toby","Perkins","Labour",3500,400,"Same MP","Toby Perkins",null,"Manufacturing Dependent",8.1632653061224492,8.1999999999999993,8.1999999999999993,285,{"$f":"VLOOKUP(B140,'2022emp'!$A$2:$B$633,2,FALSE)","v":3500},{"$f":"VLOOKUP(B140,'2022emp'!$A$2:$F$633,4,FALSE)","v":48000},{"$f":"VLOOKUP(B140,'2022emp'!$A$2:$H$633,7,FALSE)","v":3000},{"$f":"VLOOKUP(B140,'2022emp'!$A$2:$H$633,8,FALSE)","v":350},10,7.291666666666667,"Not Manufacturing Dependent",7.3]
["South East","Chichester",6000,54000,11.111111111111111,345,345,345,0,0,"Gillian","Keegan","Conservative","Hold","Gillian","Keegan","Conservative",6000,400,"Same MP","Gillian Keegan",null,"Manufacturing Dependent",8.9285714285714288,8.9,8.9,320,{"$f":"VLOOKUP(B141,'2022emp'!$A$2:$B$633,2,FALSE)","v":6000},{"$f":"VLOOKUP(B141,'2022emp'!$A$2:$F$633,4,FALSE)","v":55000},{"$f":"VLOOKUP(B141,'2022emp'!$A$2:$H$633,7,FALSE)","v":5000},{"$f":"VLOOKUP(B141,'2022emp'!$A$2:$H$633,8,FALSE)","v":600},-25,10.909090909090908,"Manufacturing Dependent",10.9]
["London","Chingford and Woodford Green",500,27000,1.8518518518518516,110,100,110,0,10,"Iain","Duncan Smith","Conservative","Hold","Iain","Duncan Smith","Conservative",400,125,"Same MP","Iain Duncan Smith",null,"Not Manufacturing Dependent",2.1428571428571428,2.1,2.1,105,{"$f":"VLOOKUP(B142,'2022emp'!$A$2:$B$633,2,FALSE)","v":300},{"$f":"VLOOKUP(B142,'2022emp'!$A$2:$F$633,4,FALSE)","v":31000},{"$f":"VLOOKUP(B142,'2022emp'!$A$2:$H$633,7,FALSE)","v":250},{"$f":"VLOOKUP(B142,'2022emp'!$A$2:$H$633,8,FALSE)","v":50},5,0.967741935483871,"Not Manufacturing Dependent",1]
["South West","Chippenham",5000,44000,11.363636363636363,230,240,240,-10,-10,"Michelle","Donelan","Conservative","Hold","Michelle","Donelan","Conservative",5000,400,"Same MP","Michelle Donelan",null,"Manufacturing Dependent",13.953488372093023,14,14,225,{"$f":"VLOOKUP(B143,'2022emp'!$A$2:$B$633,2,FALSE)","v":6000},{"$f":"VLOOKUP(B143,'2022emp'!$A$2:$F$633,4,FALSE)","v":43000},{"$f":"VLOOKUP(B143,'2022emp'!$A$2:$H$633,7,FALSE)","v":5000},{"$f":"VLOOKUP(B143,'2022emp'!$A$2:$H$633,8,FALSE)","v":400},-15,13.953488372093023,"Manufacturing Dependent",14]
["London","Chipping Barnet",500,34000,1.4705882352941175,160,135,135,25,25,"Theresa","Villiers","Conservative","Hold","Theresa","Villiers","Conservative",400,75,"Same MP","Theresa Villiers",null,"Not Manufacturing Dependent",1.3235294117647058,1.3,1.3,170,{"$f":"VLOOKUP(B144,'2022emp'!$A$2:$B$633,2,FALSE)","v":400},{"$f":"VLOOKUP(B144,'2022emp'!$A$2:$F$633,4,FALSE)","v":35000},{"$f":"VLOOKUP(B144,'2022emp'!$A$2:$H$633,7,FALSE)","v":300},{"$f":"VLOOKUP(B144,'2022emp'!$A$2:$H$633,8,FALSE)","v":100},35,1.1428571428571428,"Not Manufacturing Dependent",1.1000000000000001]
["North West","Chorley",3000,35000,8.5714285714285712,235,220,215,20,15,"Lindsay","Hoyle","Speaker","Hold","Lindsay","Hoyle","Speaker",2250,450,"Same MP","Lindsay Hoyle",null,"Manufacturing Dependent",7.1428571428571423,7.1,7.1,240,{"$f":"VLOOKUP(B145,'2022emp'!$A$2:$B$633,2,FALSE)","v":2500},{"$f":"VLOOKUP(B145,'2022emp'!$A$2:$F$633,4,FALSE)","v":36000},{"$f":"VLOOKUP(B145,'2022emp'!$A$2:$H$633,7,FALSE)","v":2250},{"$f":"VLOOKUP(B145,'2022emp'!$A$2:$H$633,8,FALSE)","v":300},20,6.9444444444444446,"Not Manufacturing Dependent",6.9]
["South West","Christchurch",5000,35000,14.285714285714285,280,285,295,-15,-5,"Christopher","Chope","Conservative","Hold","Christopher","Chope","Conservative",4500,450,"Same MP","Christopher Chope",null,"Manufacturing Dependent",12.162162162162163,12.2,12.2,275,{"$f":"VLOOKUP(B146,'2022emp'!$A$2:$B$633,2,FALSE)","v":5000},{"$f":"VLOOKUP(B146,'2022emp'!$A$2:$F$633,4,FALSE)","v":35000},{"$f":"VLOOKUP(B146,'2022emp'!$A$2:$H$633,7,FALSE)","v":4500},{"$f":"VLOOKUP(B146,'2022emp'!$A$2:$H$633,8,FALSE)","v":600},-10,14.285714285714285,"Manufacturing Dependent",14.3]
["London","Cities of London and Westminster",9000,1192000,0.75503355704697994,1105,985,1015,90,120,"Nickie","Aiken","Conservative","Hold","Nickie","Aiken","Conservative",7000,1500,"Same MP","Nickie Aiken",null,"Not Manufacturing Dependent",0.76206604572396275,0.8,0.8,1120,{"$f":"VLOOKUP(B147,'2022emp'!$A$2:$B$633,2,FALSE)","v":15000},{"$f":"VLOOKUP(B147,'2022emp'!$A$2:$F$633,4,FALSE)","v":1345000},{"$f":"VLOOKUP(B147,'2022emp'!$A$2:$H$633,7,FALSE)","v":13000},{"$f":"VLOOKUP(B147,'2022emp'!$A$2:$H$633,8,FALSE)","v":2000},135,1.1152416356877324,"Not Manufacturing Dependent",1.1000000000000001]
["North West","City of Chester",1750,68000,2.5735294117647056,150,150,175,-25,0,"Samantha","Dixon","Labour","Hold","Chris","Matheson","Labour",1500,175,"New MP","Samantha Dixon",null,"Not Manufacturing Dependent",2.5362318840579712,2.5,2.5,155,{"$f":"VLOOKUP(B148,'2022emp'!$A$2:$B$633,2,FALSE)","v":1500},{"$f":"VLOOKUP(B148,'2022emp'!$A$2:$F$633,4,FALSE)","v":72000},{"$f":"VLOOKUP(B148,'2022emp'!$A$2:$H$633,7,FALSE)","v":1500},{"$f":"VLOOKUP(B148,'2022emp'!$A$2:$H$633,8,FALSE)","v":150},5,2.083333333333333,"Not Manufacturing Dependent",2.1]
["North East","City of Durham",1500,47000,3.1914893617021276,110,95,105,5,15,"Mary","Foy","Labour","Hold","Mary","Foy","Labour",1250,100,"Same MP","Mary Foy",null,"Not Manufacturing Dependent",2.7173913043478262,2.7,2.7,105,{"$f":"VLOOKUP(B149,'2022emp'!$A$2:$B$633,2,FALSE)","v":1500},{"$f":"VLOOKUP(B149,'2022emp'!$A$2:$F$633,4,FALSE)","v":54000},{"$f":"VLOOKUP(B149,'2022emp'!$A$2:$H$633,7,FALSE)","v":1250},{"$f":"VLOOKUP(B149,'2022emp'!$A$2:$H$633,8,FALSE)","v":225},10,2.7777777777777777,"Not Manufacturing Dependent",2.8]
["Eastern","Clacton",1000,22000,4.5454545454545459,140,135,130,10,5,"Giles","Watling","Conservative","Hold","Giles","Watling","Conservative",1000,100,"Same MP","Giles Watling",null,"Not Manufacturing Dependent",5.9523809523809517,6,6,140,{"$f":"VLOOKUP(B150,'2022emp'!$A$2:$B$633,2,FALSE)","v":1250},{"$f":"VLOOKUP(B150,'2022emp'!$A$2:$F$633,4,FALSE)","v":22000},{"$f":"VLOOKUP(B150,'2022emp'!$A$2:$H$633,7,FALSE)","v":1000},{"$f":"VLOOKUP(B150,'2022emp'!$A$2:$H$633,8,FALSE)","v":175},5,5.6818181818181817,"Not Manufacturing Dependent",5.7]
["Yorkshire & the Humber","Cleethorpes",9000,39000,23.076923076923077,195,200,205,-10,-5,"Martin","Vickers","Conservative","Hold","Martin","Vickers","Conservative",8000,500,"Same MP","Martin Vickers",null,"Very Manufacturing Dependent",20.512820512820511,20.5,20.5,175,{"$f":"VLOOKUP(B151,'2022emp'!$A$2:$B$633,2,FALSE)","v":9000},{"$f":"VLOOKUP(B151,'2022emp'!$A$2:$F$633,4,FALSE)","v":38000},{"$f":"VLOOKUP(B151,'2022emp'!$A$2:$H$633,7,FALSE)","v":9000},{"$f":"VLOOKUP(B151,'2022emp'!$A$2:$H$633,8,FALSE)","v":400},-25,23.684210526315788,"Very Manufacturing Dependent",23.7]
["Wales","Clwyd South",3000,15000,20,145,135,130,15,10,"Simon","Baynes","Conservative","Hold","Simon","Baynes","Conservative",3000,250,"Same MP","Simon Baynes",null,"Very Manufacturing Dependent",20.588235294117645,20.6,20.6,130,{"$f":"VLOOKUP(B152,'2022emp'!$A$2:$B$633,2,FALSE)","v":3500},{"$f":"VLOOKUP(B152,'2022emp'!$A$2:$F$633,4,FALSE)","v":16000},{"$f":"VLOOKUP(B152,'2022emp'!$A$2:$H$633,7,FALSE)","v":3000},{"$f":"VLOOKUP(B152,'2022emp'!$A$2:$H$633,8,FALSE)","v":300},-5,21.875,"Very Manufacturing Dependent",21.9]
["Wales","Clwyd West",1250,24000,5.2083333333333339,170,125,135,35,45,"David","Jones","Conservative","Hold","David","Jones","Conservative",1000,125,"Same MP","David Jones",null,"Not Manufacturing Dependent",4,4,4,160,{"$f":"VLOOKUP(B153,'2022emp'!$A$2:$B$633,2,FALSE)","v":1250},{"$f":"VLOOKUP(B153,'2022emp'!$A$2:$F$633,4,FALSE)","v":26000},{"$f":"VLOOKUP(B153,'2022emp'!$A$2:$H$633,7,FALSE)","v":1000},{"$f":"VLOOKUP(B153,'2022emp'!$A$2:$H$633,8,FALSE)","v":125},35,4.8076923076923084,"Not Manufacturing Dependent",4.8]
["Scotland","Coatbridge, Chryston and Bellshill",5000,45000,11.111111111111111,145,135,150,-5,10,"Steven","Bonnar","Scottish National Party","Hold","Steven","Bonnar","Scottish National Party",4500,400,"Same MP","Steven Bonnar",null,"Manufacturing Dependent",10,10,10,145,{"$f":"VLOOKUP(B154,'2022emp'!$A$2:$B$633,2,FALSE)","v":4500},{"$f":"VLOOKUP(B154,'2022emp'!$A$2:$F$633,4,FALSE)","v":43000},{"$f":"VLOOKUP(B154,'2022emp'!$A$2:$H$633,7,FALSE)","v":4000},{"$f":"VLOOKUP(B154,'2022emp'!$A$2:$H$633,8,FALSE)","v":400},10,10.465116279069768,"Manufacturing Dependent",10.5]
["Eastern","Colchester",2500,57000,4.3859649122807012,165,165,165,0,0,"Will","Quince","Conservative","Hold","Will","Quince","Conservative",2500,250,"Same MP","Will Quince",null,"Not Manufacturing Dependent",5.0847457627118651,5.0999999999999996,5.0999999999999996,170,{"$f":"VLOOKUP(B155,'2022emp'!$A$2:$B$633,2,FALSE)","v":3000},{"$f":"VLOOKUP(B155,'2022emp'!$A$2:$F$633,4,FALSE)","v":57000},{"$f":"VLOOKUP(B155,'2022emp'!$A$2:$H$633,7,FALSE)","v":2500},{"$f":"VLOOKUP(B155,'2022emp'!$A$2:$H$633,8,FALSE)","v":450},5,5.2631578947368416,"Not Manufacturing Dependent",5.3]
["Yorkshire & the Humber","Colne Valley",5000,28000,17.857142857142858,345,335,335,10,10,"Jason","McCartney","Conservative","Hold","Jason","McCartney","Conservative",4500,500,"Same MP","Jason McCartney",null,"Very Manufacturing Dependent",16.666666666666664,16.7,16.7,345,{"$f":"VLOOKUP(B156,'2022emp'!$A$2:$B$633,2,FALSE)","v":5000},{"$f":"VLOOKUP(B156,'2022emp'!$A$2:$F$633,4,FALSE)","v":29000},{"$f":"VLOOKUP(B156,'2022emp'!$A$2:$H$633,7,FALSE)","v":4500},{"$f":"VLOOKUP(B156,'2022emp'!$A$2:$H$633,8,FALSE)","v":400},10,17.241379310344829,"Manufacturing Dependent",17.2]
["North West","Congleton",4000,32000,12.5,285,280,285,0,5,"Fiona","Bruce","Conservative","Hold","Fiona","Bruce","Conservative",3500,500,"Same MP","Fiona Bruce",null,"Manufacturing Dependent",13.636363636363635,13.6,13.6,250,{"$f":"VLOOKUP(B157,'2022emp'!$A$2:$B$633,2,FALSE)","v":3500},{"$f":"VLOOKUP(B157,'2022emp'!$A$2:$F$633,4,FALSE)","v":33000},{"$f":"VLOOKUP(B157,'2022emp'!$A$2:$H$633,7,FALSE)","v":3500},{"$f":"VLOOKUP(B157,'2022emp'!$A$2:$H$633,8,FALSE)","v":400},-30,10.606060606060606,"Manufacturing Dependent",10.6]
["North West","Copeland",11000,35000,31.428571428571427,145,145,145,0,0,"Trudy","Harrison","Conservative","Hold","Trudy","Harrison","Conservative",10000,900,"Same MP","Trudy Harrison",null,"Extremely Manufacturing Dependent",31.578947368421051,31.6,31.6,110,{"$f":"VLOOKUP(B158,'2022emp'!$A$2:$B$633,2,FALSE)","v":11000},{"$f":"VLOOKUP(B158,'2022emp'!$A$2:$F$633,4,FALSE)","v":37000},{"$f":"VLOOKUP(B158,'2022emp'!$A$2:$H$633,7,FALSE)","v":10000},{"$f":"VLOOKUP(B158,'2022emp'!$A$2:$H$633,8,FALSE)","v":700},-35,29.72972972972973,"Extremely Manufacturing Dependent",29.7]
["East Midlands","Corby",9000,53000,16.981132075471699,355,320,335,20,35,"Tom","Pursglove","Conservative","Hold","Tom","Pursglove","Conservative",8000,800,"Same MP","Tom Pursglove",null,"Very Manufacturing Dependent",19.607843137254903,19.600000000000001,19.600000000000001,350,{"$f":"VLOOKUP(B159,'2022emp'!$A$2:$B$633,2,FALSE)","v":8000},{"$f":"VLOOKUP(B159,'2022emp'!$A$2:$F$633,4,FALSE)","v":53000},{"$f":"VLOOKUP(B159,'2022emp'!$A$2:$H$633,7,FALSE)","v":8000},{"$f":"VLOOKUP(B159,'2022emp'!$A$2:$H$633,8,FALSE)","v":800},30,15.09433962264151,"Manufacturing Dependent",15.1]
["West Midlands","Coventry North East",4500,54000,8.3333333333333321,270,275,275,-5,-5,"Colleen","Fletcher","Labour","Hold","Colleen","Fletcher","Labour",4500,250,"Same MP","Colleen Fletcher",null,"Manufacturing Dependent",8.4905660377358494,8.5,8.5,270,{"$f":"VLOOKUP(B160,'2022emp'!$A$2:$B$633,2,FALSE)","v":5000},{"$f":"VLOOKUP(B160,'2022emp'!$A$2:$F$633,4,FALSE)","v":53000},{"$f":"VLOOKUP(B160,'2022emp'!$A$2:$H$633,7,FALSE)","v":4500},{"$f":"VLOOKUP(B160,'2022emp'!$A$2:$H$633,8,FALSE)","v":500},-5,9.433962264150944,"Manufacturing Dependent",9.4]
["West Midlands","Coventry North West",2500,26000,9.6153846153846168,145,135,150,-5,10,"Taiwo","Owatemi","Labour","Hold","Taiwo","Owatemi","Labour",2250,100,"Same MP","Taiwo Owatemi",null,"Manufacturing Dependent",10.227272727272728,10.199999999999999,10.199999999999999,125,{"$f":"VLOOKUP(B161,'2022emp'!$A$2:$B$633,2,FALSE)","v":2000},{"$f":"VLOOKUP(B161,'2022emp'!$A$2:$F$633,4,FALSE)","v":25000},{"$f":"VLOOKUP(B161,'2022emp'!$A$2:$H$633,7,FALSE)","v":2000},{"$f":"VLOOKUP(B161,'2022emp'!$A$2:$H$633,8,FALSE)","v":100},-10,8,"Not Manufacturing Dependent",8]
["West Midlands","Coventry South",9000,82000,10.975609756097562,245,270,280,-35,-25,"Zarah","Sultana","Labour","Hold","Zarah","Sultana","Labour",9000,350,"Same MP","Zarah Sultana",null,"Manufacturing Dependent",12.790697674418606,12.8,12.8,240,{"$f":"VLOOKUP(B162,'2022emp'!$A$2:$B$633,2,FALSE)","v":8000},{"$f":"VLOOKUP(B162,'2022emp'!$A$2:$F$633,4,FALSE)","v":85000},{"$f":"VLOOKUP(B162,'2022emp'!$A$2:$H$633,7,FALSE)","v":7000},{"$f":"VLOOKUP(B162,'2022emp'!$A$2:$H$633,8,FALSE)","v":800},-30,9.4117647058823533,"Manufacturing Dependent",9.4]
["South East","Crawley",7000,92000,7.608695652173914,170,160,160,10,10,"Henry","Smith","Conservative","Hold","Henry","Smith","Conservative",6000,600,"Same MP","Henry Smith",null,"Not Manufacturing Dependent",7.4468085106382977,7.4,7.4,140,{"$f":"VLOOKUP(B163,'2022emp'!$A$2:$B$633,2,FALSE)","v":6000},{"$f":"VLOOKUP(B163,'2022emp'!$A$2:$F$633,4,FALSE)","v":85000},{"$f":"VLOOKUP(B163,'2022emp'!$A$2:$H$633,7,FALSE)","v":6000},{"$f":"VLOOKUP(B163,'2022emp'!$A$2:$H$633,8,FALSE)","v":400},-20,7.0588235294117645,"Not Manufacturing Dependent",7.1]
["North West","Crewe and Nantwich",8000,52000,15.384615384615385,165,190,180,-15,-25,"Kieran","Mullan","Conservative","Hold","Kieran John","Mullan","Conservative",8000,400,"Same MP","Kieran Mullan",null,"Manufacturing Dependent",17.307692307692307,17.3,17.3,175,{"$f":"VLOOKUP(B164,'2022emp'!$A$2:$B$633,2,FALSE)","v":8000},{"$f":"VLOOKUP(B164,'2022emp'!$A$2:$F$633,4,FALSE)","v":56000},{"$f":"VLOOKUP(B164,'2022emp'!$A$2:$H$633,7,FALSE)","v":8000},{"$f":"VLOOKUP(B164,'2022emp'!$A$2:$H$633,8,FALSE)","v":500},-15,14.285714285714285,"Manufacturing Dependent",14.3]
["London","Croydon Central",500,52000,0.96153846153846156,135,120,130,5,15,"Sarah","Jones","Labour","Hold","Sarah","Jones","Labour",450,75,"Same MP","Sarah Jones",null,"Not Manufacturing Dependent",0.98039215686274506,1,1,125,{"$f":"VLOOKUP(B165,'2022emp'!$A$2:$B$633,2,FALSE)","v":500},{"$f":"VLOOKUP(B165,'2022emp'!$A$2:$F$633,4,FALSE)","v":54000},{"$f":"VLOOKUP(B165,'2022emp'!$A$2:$H$633,7,FALSE)","v":450},{"$f":"VLOOKUP(B165,'2022emp'!$A$2:$H$633,8,FALSE)","v":75},5,0.92592592592592582,"Not Manufacturing Dependent",0.9]
["London","Croydon North",900,39000,2.3076923076923079,185,150,170,15,35,"Steve","Reed","Labour/Co-operative","Hold","Steve","Reed","Labour/Co-operative",700,125,"Same MP","Steve Reed",null,"Not Manufacturing Dependent",2.3076923076923079,2.2999999999999998,2.2999999999999998,160,{"$f":"VLOOKUP(B166,'2022emp'!$A$2:$B$633,2,FALSE)","v":900},{"$f":"VLOOKUP(B166,'2022emp'!$A$2:$F$633,4,FALSE)","v":39000},{"$f":"VLOOKUP(B166,'2022emp'!$A$2:$H$633,7,FALSE)","v":800},{"$f":"VLOOKUP(B166,'2022emp'!$A$2:$H$633,8,FALSE)","v":100},10,2.3076923076923079,"Not Manufacturing Dependent",2.2999999999999998]
["London","Croydon South",800,32000,2.5,160,155,165,-5,5,"Chris","Philp","Conservative","Hold","Chris","Philp","Conservative",700,100,"Same MP","Chris Philp",null,"Not Manufacturing Dependent",2.1875,2.2000000000000002,2.2000000000000002,130,{"$f":"VLOOKUP(B167,'2022emp'!$A$2:$B$633,2,FALSE)","v":800},{"$f":"VLOOKUP(B167,'2022emp'!$A$2:$F$633,4,FALSE)","v":31000},{"$f":"VLOOKUP(B167,'2022emp'!$A$2:$H$633,7,FALSE)","v":700},{"$f":"VLOOKUP(B167,'2022emp'!$A$2:$H$633,8,FALSE)","v":75},-25,2.5806451612903225,"Not Manufacturing Dependent",2.6]
["Scotland","Cumbernauld, Kilsyth and Kirkintilloch East",3500,36000,9.7222222222222232,155,145,150,5,10,"Stuart","McDonald","Scottish National Party","Hold","Stuart","McDonald","Scottish National Party",3000,350,"Same MP","Stuart McDonald",null,"Manufacturing Dependent",9.2105263157894726,9.1999999999999993,9.1999999999999993,150,{"$f":"VLOOKUP(B168,'2022emp'!$A$2:$B$633,2,FALSE)","v":4000},{"$f":"VLOOKUP(B168,'2022emp'!$A$2:$F$633,4,FALSE)","v":30000},{"$f":"VLOOKUP(B168,'2022emp'!$A$2:$H$633,7,FALSE)","v":3500},{"$f":"VLOOKUP(B168,'2022emp'!$A$2:$H$633,8,FALSE)","v":400},5,13.333333333333334,"Manufacturing Dependent",13.3]
["Wales","Cynon Valley",1750,16000,10.9375,100,105,100,0,-5,"Beth","Winter","Labour","Hold","Beth","Winter","Labour",1750,150,"Same MP","Beth Winter",null,"Manufacturing Dependent",10.9375,10.9,10.9,80,{"$f":"VLOOKUP(B169,'2022emp'!$A$2:$B$633,2,FALSE)","v":2250},{"$f":"VLOOKUP(B169,'2022emp'!$A$2:$F$633,4,FALSE)","v":16000},{"$f":"VLOOKUP(B169,'2022emp'!$A$2:$H$633,7,FALSE)","v":2000},{"$f":"VLOOKUP(B169,'2022emp'!$A$2:$H$633,8,FALSE)","v":350},-25,14.0625,"Manufacturing Dependent",14.1]
["London","Dagenham and Rainham",4000,32000,12.5,145,170,170,-25,-25,"Jon","Cruddas","Labour","Hold","Jon","Cruddas","Labour",4000,175,"Same MP","Jon Cruddas",null,"Manufacturing Dependent",13.333333333333334,13.3,13.3,155,{"$f":"VLOOKUP(B170,'2022emp'!$A$2:$B$633,2,FALSE)","v":3500},{"$f":"VLOOKUP(B170,'2022emp'!$A$2:$F$633,4,FALSE)","v":35000},{"$f":"VLOOKUP(B170,'2022emp'!$A$2:$H$633,7,FALSE)","v":3500},{"$f":"VLOOKUP(B170,'2022emp'!$A$2:$H$633,8,FALSE)","v":200},-15,10,"Manufacturing Dependent",10]
["North East","Darlington",2000,39000,5.1282051282051277,145,145,140,5,0,"Peter","Gibson","Conservative","Hold","Peter","Gibson","Conservative",1750,150,"Same MP","Peter Gibson",null,"Not Manufacturing Dependent",7.5,7.5,7.5,145,{"$f":"VLOOKUP(B171,'2022emp'!$A$2:$B$633,2,FALSE)","v":3500},{"$f":"VLOOKUP(B171,'2022emp'!$A$2:$F$633,4,FALSE)","v":42000},{"$f":"VLOOKUP(B171,'2022emp'!$A$2:$H$633,7,FALSE)","v":3000},{"$f":"VLOOKUP(B171,'2022emp'!$A$2:$H$633,8,FALSE)","v":350},0,8.3333333333333321,"Not Manufacturing Dependent",8.3000000000000007]
["South East","Dartford",3000,63000,4.7619047619047619,235,235,225,10,0,"Gareth","Johnson","Conservative","Hold","Gareth","Johnson","Conservative",3000,250,"Same MP","Gareth Johnson",null,"Not Manufacturing Dependent",5.5555555555555554,5.6,5.6,230,{"$f":"VLOOKUP(B172,'2022emp'!$A$2:$B$633,2,FALSE)","v":3500},{"$f":"VLOOKUP(B172,'2022emp'!$A$2:$F$633,4,FALSE)","v":70000},{"$f":"VLOOKUP(B172,'2022emp'!$A$2:$H$633,7,FALSE)","v":2500},{"$f":"VLOOKUP(B172,'2022emp'!$A$2:$H$633,8,FALSE)","v":700},-5,5,"Not Manufacturing Dependent",5]
["East Midlands","Daventry",6000,46000,13.043478260869565,365,345,345,20,20,"Chris","Heaton-Harris","Conservative","Hold","Chris","Heaton-Harris","Conservative",5000,500,"Same MP","Chris Heaton-Harris",null,"Manufacturing Dependent",12.244897959183673,12.2,12.2,330,{"$f":"VLOOKUP(B173,'2022emp'!$A$2:$B$633,2,FALSE)","v":6000},{"$f":"VLOOKUP(B173,'2022emp'!$A$2:$F$633,4,FALSE)","v":49000},{"$f":"VLOOKUP(B173,'2022emp'!$A$2:$H$633,7,FALSE)","v":5000},{"$f":"VLOOKUP(B173,'2022emp'!$A$2:$H$633,8,FALSE)","v":450},-15,12.244897959183673,"Manufacturing Dependent",12.2]
["Wales","Delyn",4000,23000,17.391304347826086,160,155,160,0,5,"Rob","Roberts","Independent","Change","Rob","Roberts","Conservative",4000,250,"Same MP","Rob Roberts",null,"Very Manufacturing Dependent",18,18,18,150,{"$f":"VLOOKUP(B174,'2022emp'!$A$2:$B$633,2,FALSE)","v":6000},{"$f":"VLOOKUP(B174,'2022emp'!$A$2:$F$633,4,FALSE)","v":24000},{"$f":"VLOOKUP(B174,'2022emp'!$A$2:$H$633,7,FALSE)","v":5000},{"$f":"VLOOKUP(B174,'2022emp'!$A$2:$H$633,8,FALSE)","v":350},-5,25,"Very Manufacturing Dependent",25]
["North West","Denton and Reddish",5000,24000,20.833333333333336,285,275,270,15,10,"Andrew","Gwynne","Labour","Hold","Andrew","Gwynne","Labour",4500,600,"Same MP","Andrew Gwynne",null,"Very Manufacturing Dependent",20,20,20,260,{"$f":"VLOOKUP(B175,'2022emp'!$A$2:$B$633,2,FALSE)","v":5000},{"$f":"VLOOKUP(B175,'2022emp'!$A$2:$F$633,4,FALSE)","v":26000},{"$f":"VLOOKUP(B175,'2022emp'!$A$2:$H$633,7,FALSE)","v":4500},{"$f":"VLOOKUP(B175,'2022emp'!$A$2:$H$633,8,FALSE)","v":500},-15,19.230769230769234,"Very Manufacturing Dependent",19.2]
["East Midlands","Derby North",3000,46000,6.5217391304347823,210,210,210,0,0,"Amanda","Solloway","Conservative","Hold","Amanda","Solloway","Conservative",2500,300,"Same MP","Amanda Solloway",null,"Not Manufacturing Dependent",5,5,5,160,{"$f":"VLOOKUP(B176,'2022emp'!$A$2:$B$633,2,FALSE)","v":2500},{"$f":"VLOOKUP(B176,'2022emp'!$A$2:$F$633,4,FALSE)","v":49000},{"$f":"VLOOKUP(B176,'2022emp'!$A$2:$H$633,7,FALSE)","v":2000},{"$f":"VLOOKUP(B176,'2022emp'!$A$2:$H$633,8,FALSE)","v":300},-50,5.1020408163265305,"Not Manufacturing Dependent",5.0999999999999996]
["East Midlands","Derby South",24000,82000,29.268292682926827,215,195,205,10,20,"Margaret","Beckett","Labour","Hold","Margaret","Beckett","Labour",23000,1250,"Same MP","Margaret Beckett",null,"Extremely Manufacturing Dependent",29.629629629629626,29.6,29.6,195,{"$f":"VLOOKUP(B177,'2022emp'!$A$2:$B$633,2,FALSE)","v":19000},{"$f":"VLOOKUP(B177,'2022emp'!$A$2:$F$633,4,FALSE)","v":78000},{"$f":"VLOOKUP(B177,'2022emp'!$A$2:$H$633,7,FALSE)","v":18000},{"$f":"VLOOKUP(B177,'2022emp'!$A$2:$H$633,8,FALSE)","v":700},0,24.358974358974358,"Very Manufacturing Dependent",24.4]
["East Midlands","Derbyshire Dales",5000,34000,14.705882352941178,300,300,295,5,0,"Sarah","Dines","Conservative","Hold","Sarah Elizabeth","Dines","Conservative",4500,500,"Same MP","Sarah Dines",null,"Manufacturing Dependent",13.888888888888889,13.9,13.9,290,{"$f":"VLOOKUP(B178,'2022emp'!$A$2:$B$633,2,FALSE)","v":5000},{"$f":"VLOOKUP(B178,'2022emp'!$A$2:$F$633,4,FALSE)","v":36000},{"$f":"VLOOKUP(B178,'2022emp'!$A$2:$H$633,7,FALSE)","v":4500},{"$f":"VLOOKUP(B178,'2022emp'!$A$2:$H$633,8,FALSE)","v":450},-10,13.888888888888889,"Manufacturing Dependent",13.9]
["South West","Devizes",3000,32000,9.375,200,205,215,-15,-5,"Danny","Kruger","Conservative","Hold","Danny","Kruger","Conservative",3000,225,"Same MP","Danny Kruger",null,"Manufacturing Dependent",9.375,9.4,9.4,205,{"$f":"VLOOKUP(B179,'2022emp'!$A$2:$B$633,2,FALSE)","v":3000},{"$f":"VLOOKUP(B179,'2022emp'!$A$2:$F$633,4,FALSE)","v":32000},{"$f":"VLOOKUP(B179,'2022emp'!$A$2:$H$633,7,FALSE)","v":2500},{"$f":"VLOOKUP(B179,'2022emp'!$A$2:$H$633,8,FALSE)","v":300},0,9.375,"Manufacturing Dependent",9.4]
["Yorkshire & the Humber","Dewsbury",6000,33000,18.181818181818183,425,395,400,25,30,"Mark","Eastwood","Conservative","Hold","Mark","Eastwood","Conservative",6000,800,"Same MP","Mark Eastwood",null,"Very Manufacturing Dependent",25,25,25,450,{"$f":"VLOOKUP(B180,'2022emp'!$A$2:$B$633,2,FALSE)","v":8000},{"$f":"VLOOKUP(B180,'2022emp'!$A$2:$F$633,4,FALSE)","v":36000},{"$f":"VLOOKUP(B180,'2022emp'!$A$2:$H$633,7,FALSE)","v":7000},{"$f":"VLOOKUP(B180,'2022emp'!$A$2:$H$633,8,FALSE)","v":900},55,22.222222222222221,"Very Manufacturing Dependent",22.2]
["Yorkshire & the Humber","Don Valley",3500,29000,12.068965517241379,195,155,170,25,40,"Nicholas","Fletcher","Conservative","Hold","Nicholas","Fletcher","Conservative",3500,300,"Same MP","Nicholas Fletcher",null,"Manufacturing Dependent",12.962962962962962,13,13,165,{"$f":"VLOOKUP(B181,'2022emp'!$A$2:$B$633,2,FALSE)","v":4000},{"$f":"VLOOKUP(B181,'2022emp'!$A$2:$F$633,4,FALSE)","v":34000},{"$f":"VLOOKUP(B181,'2022emp'!$A$2:$H$633,7,FALSE)","v":3500},{"$f":"VLOOKUP(B181,'2022emp'!$A$2:$H$633,8,FALSE)","v":350},10,11.76470588235294,"Manufacturing Dependent",11.8]
["Yorkshire & the Humber","Doncaster Central",6000,71000,8.4507042253521121,215,205,220,-5,10,"Rosie","Winterton","Labour","Hold","Rosie","Winterton","Labour",6000,700,"Same MP","Rosie Winterton",null,"Manufacturing Dependent",8.4507042253521121,8.5,8.5,240,{"$f":"VLOOKUP(B182,'2022emp'!$A$2:$B$633,2,FALSE)","v":6000},{"$f":"VLOOKUP(B182,'2022emp'!$A$2:$F$633,4,FALSE)","v":75000},{"$f":"VLOOKUP(B182,'2022emp'!$A$2:$H$633,7,FALSE)","v":6000},{"$f":"VLOOKUP(B182,'2022emp'!$A$2:$H$633,8,FALSE)","v":400},35,8,"Not Manufacturing Dependent",8]
["Yorkshire & the Humber","Doncaster North",1500,22000,6.8181818181818175,150,165,150,0,-15,"Ed","Miliband","Labour","Hold","Ed","Miliband","Labour",1250,100,"Same MP","Ed Miliband",null,"Not Manufacturing Dependent",6.8181818181818175,6.8,6.8,145,{"$f":"VLOOKUP(B183,'2022emp'!$A$2:$B$633,2,FALSE)","v":1250},{"$f":"VLOOKUP(B183,'2022emp'!$A$2:$F$633,4,FALSE)","v":24000},{"$f":"VLOOKUP(B183,'2022emp'!$A$2:$H$633,7,FALSE)","v":1250},{"$f":"VLOOKUP(B183,'2022emp'!$A$2:$H$633,8,FALSE)","v":175},-20,5.2083333333333339,"Not Manufacturing Dependent",5.2]
["South East","Dover",2250,26000,8.6538461538461533,140,130,135,5,10,"Natalie","Elphicke","Conservative","Hold","Natalie","Elphicke","Conservative",2250,175,"Same MP","Natalie Elphicke",null,"Manufacturing Dependent",9.2592592592592595,9.3000000000000007,9.3000000000000007,135,{"$f":"VLOOKUP(B184,'2022emp'!$A$2:$B$633,2,FALSE)","v":2250},{"$f":"VLOOKUP(B184,'2022emp'!$A$2:$F$633,4,FALSE)","v":28000},{"$f":"VLOOKUP(B184,'2022emp'!$A$2:$H$633,7,FALSE)","v":2000},{"$f":"VLOOKUP(B184,'2022emp'!$A$2:$H$633,8,FALSE)","v":150},5,8.0357142857142865,"Not Manufacturing Dependent",8]
["West Midlands","Dudley North",1750,29000,6.0344827586206895,150,155,160,-10,-5,"Marco","Longhi","Conservative","Hold","Marco","Longhi","Conservative",1500,175,"Same MP","Marco Longhi",null,"Not Manufacturing Dependent",6.8965517241379306,6.9,6.9,155,{"$f":"VLOOKUP(B185,'2022emp'!$A$2:$B$633,2,FALSE)","v":2000},{"$f":"VLOOKUP(B185,'2022emp'!$A$2:$F$633,4,FALSE)","v":31000},{"$f":"VLOOKUP(B185,'2022emp'!$A$2:$H$633,7,FALSE)","v":1750},{"$f":"VLOOKUP(B185,'2022emp'!$A$2:$H$633,8,FALSE)","v":200},0,6.4516129032258061,"Not Manufacturing Dependent",6.5]
["West Midlands","Dudley South",8000,41000,19.512195121951219,400,390,410,-10,10,"Mike","Wood","Conservative","Hold","Mike","Wood","Conservative",7000,600,"Same MP","Mike Wood",null,"Very Manufacturing Dependent",20,20,20,385,{"$f":"VLOOKUP(B186,'2022emp'!$A$2:$B$633,2,FALSE)","v":8000},{"$f":"VLOOKUP(B186,'2022emp'!$A$2:$F$633,4,FALSE)","v":39000},{"$f":"VLOOKUP(B186,'2022emp'!$A$2:$H$633,7,FALSE)","v":7000},{"$f":"VLOOKUP(B186,'2022emp'!$A$2:$H$633,8,FALSE)","v":1000},-5,20.512820512820511,"Very Manufacturing Dependent",20.5]
["London","Dulwich and West Norwood",700,36000,1.9444444444444444,160,145,145,15,15,"Helen","Hayes","Labour","Hold","Helen","Hayes","Labour",500,175,"Same MP","Helen Hayes",null,"Not Manufacturing Dependent",1.6666666666666667,1.7,1.7,155,{"$f":"VLOOKUP(B187,'2022emp'!$A$2:$B$633,2,FALSE)","v":900},{"$f":"VLOOKUP(B187,'2022emp'!$A$2:$F$633,4,FALSE)","v":39000},{"$f":"VLOOKUP(B187,'2022emp'!$A$2:$H$633,7,FALSE)","v":800},{"$f":"VLOOKUP(B187,'2022emp'!$A$2:$H$633,8,FALSE)","v":150},10,2.3076923076923079,"Not Manufacturing Dependent",2.2999999999999998]
["Scotland","Dumfries and Galloway",2500,34000,7.3529411764705888,170,180,175,-5,-10,"Alister","Jack","Conservative","Hold","Alister","Jack","Conservative",2250,400,"Same MP","Alister Jack",null,"Not Manufacturing Dependent",7.1428571428571423,7.1,7.1,175,{"$f":"VLOOKUP(B188,'2022emp'!$A$2:$B$633,2,FALSE)","v":2500},{"$f":"VLOOKUP(B188,'2022emp'!$A$2:$F$633,4,FALSE)","v":36000},{"$f":"VLOOKUP(B188,'2022emp'!$A$2:$H$633,7,FALSE)","v":2000},{"$f":"VLOOKUP(B188,'2022emp'!$A$2:$H$633,8,FALSE)","v":350},-5,6.9444444444444446,"Not Manufacturing Dependent",6.9]
["Scotland","Dumfriesshire, Clydesdale and Tweeddale",3500,27000,12.962962962962962,195,190,195,0,5,"David","Mundell","Conservative","Hold","David","Mundell","Conservative",3000,400,"Same MP","David Mundell",null,"Manufacturing Dependent",12.068965517241379,12.1,12.1,210,{"$f":"VLOOKUP(B189,'2022emp'!$A$2:$B$633,2,FALSE)","v":3500},{"$f":"VLOOKUP(B189,'2022emp'!$A$2:$F$633,4,FALSE)","v":28000},{"$f":"VLOOKUP(B189,'2022emp'!$A$2:$H$633,7,FALSE)","v":3000},{"$f":"VLOOKUP(B189,'2022emp'!$A$2:$H$633,8,FALSE)","v":300},20,12.5,"Manufacturing Dependent",12.5]
["Scotland","Dundee East",1750,24000,7.291666666666667,90,85,85,5,5,"Stewart","Hosie","Scottish National Party","Hold","Stewart","Hosie","Scottish National Party",1500,100,"Same MP","Stewart Hosie",null,"Not Manufacturing Dependent",10,10,10,90,{"$f":"VLOOKUP(B190,'2022emp'!$A$2:$B$633,2,FALSE)","v":1500},{"$f":"VLOOKUP(B190,'2022emp'!$A$2:$F$633,4,FALSE)","v":25000},{"$f":"VLOOKUP(B190,'2022emp'!$A$2:$H$633,7,FALSE)","v":1500},{"$f":"VLOOKUP(B190,'2022emp'!$A$2:$H$633,8,FALSE)","v":100},5,6,"Not Manufacturing Dependent",6]
["Scotland","Dundee West",2000,55000,3.6363636363636362,125,120,135,-10,5,"Chris","Law","Scottish National Party","Hold","Chris","Law","Scottish National Party",1750,250,"Same MP","Chris Law",null,"Not Manufacturing Dependent",4.0909090909090908,4.0999999999999996,4.0999999999999996,125,{"$f":"VLOOKUP(B191,'2022emp'!$A$2:$B$633,2,FALSE)","v":2000},{"$f":"VLOOKUP(B191,'2022emp'!$A$2:$F$633,4,FALSE)","v":57000},{"$f":"VLOOKUP(B191,'2022emp'!$A$2:$H$633,7,FALSE)","v":1750},{"$f":"VLOOKUP(B191,'2022emp'!$A$2:$H$633,8,FALSE)","v":300},5,3.5087719298245612,"Not Manufacturing Dependent",3.5]
["Scotland","Dunfermline and West Fife",3500,39000,8.9743589743589745,145,150,155,-10,-5,"Douglas","Chapman","Scottish National Party","Hold","Douglas","Chapman","Scottish National Party",3500,225,"Same MP","Douglas Chapman",null,"Manufacturing Dependent",9.7560975609756095,9.8000000000000007,9.8000000000000007,130,{"$f":"VLOOKUP(B192,'2022emp'!$A$2:$B$633,2,FALSE)","v":3500},{"$f":"VLOOKUP(B192,'2022emp'!$A$2:$F$633,4,FALSE)","v":44000},{"$f":"VLOOKUP(B192,'2022emp'!$A$2:$H$633,7,FALSE)","v":3500},{"$f":"VLOOKUP(B192,'2022emp'!$A$2:$H$633,8,FALSE)","v":200},-20,7.9545454545454541,"Not Manufacturing Dependent",8]
["Wales","Dwyfor Meirionnydd",1500,20000,7.5,120,135,130,-10,-15,"Liz","Saville-Roberts","Plaid Cymru","Hold","Liz","Saville-Roberts","Plaid Cymru",1500,125,"Same MP","Liz Saville-Roberts",null,"Not Manufacturing Dependent",7.5,7.5,7.5,125,{"$f":"VLOOKUP(B193,'2022emp'!$A$2:$B$633,2,FALSE)","v":1750},{"$f":"VLOOKUP(B193,'2022emp'!$A$2:$F$633,4,FALSE)","v":21000},{"$f":"VLOOKUP(B193,'2022emp'!$A$2:$H$633,7,FALSE)","v":1500},{"$f":"VLOOKUP(B193,'2022emp'!$A$2:$H$633,8,FALSE)","v":175},-10,8.3333333333333321,"Not Manufacturing Dependent",8.3000000000000007]
["London","Ealing Central and Acton",6000,66000,9.0909090909090917,325,305,305,20,20,"Rupa","Huq","Labour","Hold","Rupa","Huq","Labour",5000,1000,"Same MP","Rupa Huq",null,"Manufacturing Dependent",8.8235294117647065,8.8000000000000007,8.8000000000000007,325,{"$f":"VLOOKUP(B194,'2022emp'!$A$2:$B$633,2,FALSE)","v":6000},{"$f":"VLOOKUP(B194,'2022emp'!$A$2:$F$633,4,FALSE)","v":65000},{"$f":"VLOOKUP(B194,'2022emp'!$A$2:$H$633,7,FALSE)","v":5000},{"$f":"VLOOKUP(B194,'2022emp'!$A$2:$H$633,8,FALSE)","v":450},20,9.2307692307692317,"Manufacturing Dependent",9.1999999999999993]
["London","Ealing North",2500,32000,7.8125,195,190,190,5,5,"James","Murray","Labour/Co-operative","Hold","James","Murray","Labour/Co-operative",2250,400,"Same MP","James Murray",null,"Not Manufacturing Dependent",7.03125,7,7,185,{"$f":"VLOOKUP(B195,'2022emp'!$A$2:$B$633,2,FALSE)","v":2250},{"$f":"VLOOKUP(B195,'2022emp'!$A$2:$F$633,4,FALSE)","v":33000},{"$f":"VLOOKUP(B195,'2022emp'!$A$2:$H$633,7,FALSE)","v":2000},{"$f":"VLOOKUP(B195,'2022emp'!$A$2:$H$633,8,FALSE)","v":400},-5,6.8181818181818175,"Not Manufacturing Dependent",6.8]
["London","Ealing, Southall",3000,30000,10,145,150,145,0,-5,"Virendra","Sharma","Labour","Hold","Virendra","Sharma","Labour",2500,350,"Same MP","Virendra Sharma",null,"Manufacturing Dependent",12.962962962962962,13,13,155,{"$f":"VLOOKUP(B196,'2022emp'!$A$2:$B$633,2,FALSE)","v":3000},{"$f":"VLOOKUP(B196,'2022emp'!$A$2:$F$633,4,FALSE)","v":30000},{"$f":"VLOOKUP(B196,'2022emp'!$A$2:$H$633,7,FALSE)","v":2500},{"$f":"VLOOKUP(B196,'2022emp'!$A$2:$H$633,8,FALSE)","v":300},5,10,"Manufacturing Dependent",10]
["North East","Easington",4500,26000,17.307692307692307,120,105,105,15,15,"Grahame","Morris","Labour","Hold","Grahame","Morris","Labour",4000,175,"Same MP","Grahame Morris",null,"Very Manufacturing Dependent",19.230769230769234,19.2,19.2,115,{"$f":"VLOOKUP(B197,'2022emp'!$A$2:$B$633,2,FALSE)","v":4000},{"$f":"VLOOKUP(B197,'2022emp'!$A$2:$F$633,4,FALSE)","v":25000},{"$f":"VLOOKUP(B197,'2022emp'!$A$2:$H$633,7,FALSE)","v":3500},{"$f":"VLOOKUP(B197,'2022emp'!$A$2:$H$633,8,FALSE)","v":350},10,16,"Manufacturing Dependent",16]
["Northern Ireland","East Antrim",null,null,{"$error":"#DIV/0!"},195,155,170,25,40,"Sammy","Wilson","DUP","Hold","Sammy","Wilson","DUP",null,null,"Same MP","Sammy Wilson",null,{"$error":"#DIV/0!"},16.98154851240399,17,17,175,{"$f":"VLOOKUP(B198,'2022emp'!$A$2:$B$633,2,FALSE)","v":{"$error":"#N/A"}},{"$f":"VLOOKUP(B198,'2022emp'!$A$2:$F$633,4,FALSE)","v":{"$error":"#N/A"}},{"$f":"VLOOKUP(B198,'2022emp'!$A$2:$H$633,7,FALSE)","v":{"$error":"#N/A"}},{"$f":"VLOOKUP(B198,'2022emp'!$A$2:$H$633,8,FALSE)","v":{"$error":"#N/A"}},20,null,"Not Manufacturing Dependent",0]
["South West","East Devon",2500,54000,4.6296296296296298,195,195,205,-10,0,"Simon","Jupp","Conservative","Hold","Simon","Jupp","Conservative",2500,175,"Same MP","Simon Jupp",null,"Not Manufacturing Dependent",4.716981132075472,4.7,4.7,205,{"$f":"VLOOKUP(B199,'2022emp'!$A$2:$B$633,2,FALSE)","v":2500},{"$f":"VLOOKUP(B199,'2022emp'!$A$2:$F$633,4,FALSE)","v":58000},{"$f":"VLOOKUP(B199,'2022emp'!$A$2:$H$633,7,FALSE)","v":2250},{"$f":"VLOOKUP(B199,'2022emp'!$A$2:$H$633,8,FALSE)","v":250},10,4.3103448275862073,"Not Manufacturing Dependent",4.3]
["Scotland","East Dunbartonshire",1000,20000,5,100,85,95,5,15,"Amy","Callaghan","Scottish National Party","Hold","Amy","Callaghan","Scottish National Party",1000,75,"Same MP","Amy Callaghan",null,"Not Manufacturing Dependent",5.9523809523809517,6,6,85,{"$f":"VLOOKUP(B200,'2022emp'!$A$2:$B$633,2,FALSE)","v":900},{"$f":"VLOOKUP(B200,'2022emp'!$A$2:$F$633,4,FALSE)","v":21000},{"$f":"VLOOKUP(B200,'2022emp'!$A$2:$H$633,7,FALSE)","v":800},{"$f":"VLOOKUP(B200,'2022emp'!$A$2:$H$633,8,FALSE)","v":100},0,4.2857142857142856,"Not Manufacturing Dependent",4.3]
["London","East Ham",2500,39000,6.4102564102564097,170,140,145,{"$f":"F201-H201","v":25},{"$f":"F201-G201","v":30},"Stephen","Timms","Labour","Hold","Stephen","Timms","Labour",2000,600,"Same MP",{"$f":"CONCATENATE(K201,\" \",L201)","v":"Stephen Timms"},null,{"$f":"IF(E201>24.29, \"Extremely Manufacturing Dependent\", IF(E201>16.59, \"Very Manufacturing Dependent\", IF(E201>8.09, \"Manufacturing Dependent\", \"Not Manufacturing Dependent\")))","v":"Not Manufacturing Dependent"},5.4054054054054053,5.4,5.4,210,{"$f":"VLOOKUP(B201,'2022emp'!$A$2:$B$633,2,FALSE)","v":2250},{"$f":"VLOOKUP(B201,'2022emp'!$A$2:$F$633,4,FALSE)","v":43000},{"$f":"VLOOKUP(B201,'2022emp'!$A$2:$H$633,7,FALSE)","v":2000},{"$f":"VLOOKUP(B201,'2022emp'!$A$2:$H$633,8,FALSE)","v":225},70,5.2325581395348841,"Not Manufacturing Dependent",5.2]
["South East","East Hampshire",3500,37000,9.4594594594594597,290,300,305,-15,-10,"Damian","Hinds","Conservative",{"$f":"IF(M202=Q202, \"Hold\", \"Change\")","v":"Hold"},"Damian","Hinds","Conservative",3000,450,{"$f":"IF(L202=P202, \"Same MP\", \"New MP\")","v":"Same MP"},"Damian Hinds",null,"Manufacturing Dependent",10.526315789473683,{"$f":"ROUND(X202,1)","v":10.5},10.5,320,{"$f":"VLOOKUP(B202,'2022emp'!$A$2:$B$633,2,FALSE)","v":4000},{"$f":"VLOOKUP(B202,'2022emp'!$A$2:$F$633,4,FALSE)","v":39000},{"$f":"VLOOKUP(B202,'2022emp'!$A$2:$H$633,7,FALSE)","v":3500},{"$f":"VLOOKUP(B202,'2022emp'!$A$2:$H$633,8,FALSE)","v":450},{"$f":"AA202-G202","v":20},{"$f":"(AB202/AC202)*100","v":10.256410256410255},{"$f":"IF(AG202>26.79, \"Extremely Manufacturing Dependent\", IF(AG202>17.86, \"Very Manufacturing Dependent\", IF(AG202>8.93, \"Manufacturing Dependent\", \"Not Manufacturing Dependent\")))","v":"Manufacturing Dependent"},{"$f":"ROUND(AG202,1)","v":10.3}]
["Scotland","East Kilbride, Strathaven and Lesmahagow",4000,38000,{"$f":"(C203/D203)*100","v":10.526315789473683},215,215,210,5,0,"Lisa","Cameron","Conservative","Change","Lisa","Cameron","Scottish National Party",3500,350,"Same MP","Lisa Cameron",null,"Manufacturing Dependent",10.526315789473683,10.5,10.5,210,{"$f":"VLOOKUP(B203,'2022emp'!$A$2:$B$633,2,FALSE)","v":4000},{"$f":"VLOOKUP(B203,'2022emp'!$A$2:$F$633,4,FALSE)","v":39000},{"$f":"VLOOKUP(B203,'2022emp'!$A$2:$H$633,7,FALSE)","v":3500},{"$f":"VLOOKUP(B203,'2022emp'!$A$2:$H$633,8,FALSE)","v":300},-5,10.256410256410255,"Manufacturing Dependent",10.3]
["Northern Ireland","East Londonderry",null,null,{"$error":"#DIV/0!"},195,200,190,5,-5,"Gregory","Campbell","DUP","Hold","Gregory","Campbell","DUP",null,null,"Same MP","Gregory Campbell",null,{"$error":"#DIV/0!"},9.457245092465639,9.5,9.5,210,{"$f":"VLOOKUP(B204,'2022emp'!$A$2:$B$633,2,FALSE)","v":{"$error":"#N/A"}},{"$f":"VLOOKUP(B204,'2022emp'!$A$2:$F$633,4,FALSE)","v":{"$error":"#N/A"}},{"$f":"VLOOKUP(B204,'2022emp'!$A$2:$H$633,7,FALSE)","v":{"$error":"#N/A"}},{"$f":"VLOOKUP(B204,'2022emp'!$A$2:$H$633,8,FALSE)","v":{"$error":"#N/A"}},10,null,"Not Manufacturing Dependent",0]
["Scotland","East Lothian",1750,30000,5.833333333333333,155,145,150,5,10,"Kenny","MacAskill","Alba","Change","Kenny","MacAskill","Scottish National Party",1750,125,"Same MP","Kenny MacAskill",null,"Not Manufacturing Dependent",6.666666666666667,6.7,6.7,165,{"$f":"VLOOKUP(B205,'2022emp'!$A$2:$B$633,2,FALSE)","v":2000},{"$f":"VLOOKUP(B205,'2022emp'!$A$2:$F$633,4,FALSE)","v":33000},{"$f":"VLOOKUP(B205,'2022emp'!$A$2:$H$633,7,FALSE)","v":1750},{"$f":"VLOOKUP(B205,'2022emp'!$A$2:$H$633,8,FALSE)","v":150},20,6.0606060606060606,"Not Manufacturing Dependent",6.1]
["Scotland","East Renfrewshire",500,21000,2.3809523809523809,115,115,105,10,0,"Kirsten","Oswald","Scottish National Party","Hold","Kirsten","Oswald","Scottish National Party",400,75,"Same MP","Kirsten Oswald",null,"Not Manufacturing Dependent",2.7272727272727271,2.7,2.7,105,{"$f":"VLOOKUP(B206,'2022emp'!$A$2:$B$633,2,FALSE)","v":500},{"$f":"VLOOKUP(B206,'2022emp'!$A$2:$F$633,4,FALSE)","v":21000},{"$f":"VLOOKUP(B206,'2022emp'!$A$2:$H$633,7,FALSE)","v":450},{"$f":"VLOOKUP(B206,'2022emp'!$A$2:$H$633,8,FALSE)","v":75},-10,2.3809523809523809,"Not Manufacturing Dependent",2.4]
["South East","East Surrey",1250,36000,3.4722222222222223,235,230,215,20,5,"Claire","Coutinho","Conservative","Hold","Claire","Coutinho","Conservative",1250,175,"Same MP","Claire Coutinho",null,"Not Manufacturing Dependent",3.2894736842105261,3.3,3.3,200,{"$f":"VLOOKUP(B207,'2022emp'!$A$2:$B$633,2,FALSE)","v":1000},{"$f":"VLOOKUP(B207,'2022emp'!$A$2:$F$633,4,FALSE)","v":43000},{"$f":"VLOOKUP(B207,'2022emp'!$A$2:$H$633,7,FALSE)","v":800},{"$f":"VLOOKUP(B207,'2022emp'!$A$2:$H$633,8,FALSE)","v":125},-30,2.3255813953488373,"Not Manufacturing Dependent",2.2999999999999998]
["South East","East Worthing and Shoreham",4500,32000,14.0625,240,250,235,5,-10,"Tim","Loughton","Conservative","Hold","Tim","Loughton","Conservative",4000,600,"Same MP","Tim Loughton",null,"Manufacturing Dependent",15.151515151515152,15.2,15.2,240,{"$f":"VLOOKUP(B208,'2022emp'!$A$2:$B$633,2,FALSE)","v":4500},{"$f":"VLOOKUP(B208,'2022emp'!$A$2:$F$633,4,FALSE)","v":32000},{"$f":"VLOOKUP(B208,'2022emp'!$A$2:$H$633,7,FALSE)","v":4000},{"$f":"VLOOKUP(B208,'2022emp'!$A$2:$H$633,8,FALSE)","v":450},-10,14.0625,"Manufacturing Dependent",14.1]
["Yorkshire & the Humber","East Yorkshire",6000,32000,18.75,275,280,280,-5,-5,"Greg","Knight","Conservative","Hold","Greg","Knight","Conservative",5000,600,"Same MP","Greg Knight",null,"Very Manufacturing Dependent",18.75,18.8,18.8,295,{"$f":"VLOOKUP(B209,'2022emp'!$A$2:$B$633,2,FALSE)","v":6000},{"$f":"VLOOKUP(B209,'2022emp'!$A$2:$F$633,4,FALSE)","v":34000},{"$f":"VLOOKUP(B209,'2022emp'!$A$2:$H$633,7,FALSE)","v":6000},{"$f":"VLOOKUP(B209,'2022emp'!$A$2:$H$633,8,FALSE)","v":450},15,17.647058823529413,"Manufacturing Dependent",17.600000000000001]
["South East","Eastbourne",1500,40000,3.75,140,130,140,0,10,"Caroline","Ansell","Conservative","Hold","Caroline","Ansell","Conservative",1250,175,"Same MP","Caroline Ansell",null,"Not Manufacturing Dependent",3.75,3.8,3.8,130,{"$f":"VLOOKUP(B210,'2022emp'!$A$2:$B$633,2,FALSE)","v":1750},{"$f":"VLOOKUP(B210,'2022emp'!$A$2:$F$633,4,FALSE)","v":39000},{"$f":"VLOOKUP(B210,'2022emp'!$A$2:$H$633,7,FALSE)","v":1500},{"$f":"VLOOKUP(B210,'2022emp'!$A$2:$H$633,8,FALSE)","v":175},0,4.4871794871794872,"Not Manufacturing Dependent",4.5]
["South East","Eastleigh",6000,54000,11.111111111111111,310,300,300,10,10,"Paul","Holmes","Conservative","Hold","Paul","Holmes","Conservative",5000,700,"Same MP","Paul Holmes",null,"Manufacturing Dependent",9.0909090909090917,9.1,9.1,285,{"$f":"VLOOKUP(B211,'2022emp'!$A$2:$B$633,2,FALSE)","v":4500},{"$f":"VLOOKUP(B211,'2022emp'!$A$2:$F$633,4,FALSE)","v":54000},{"$f":"VLOOKUP(B211,'2022emp'!$A$2:$H$633,7,FALSE)","v":4000},{"$f":"VLOOKUP(B211,'2022emp'!$A$2:$H$633,8,FALSE)","v":400},-15,8.3333333333333321,"Not Manufacturing Dependent",8.3000000000000007]
["North West","Eddisbury",3500,40000,8.75,240,215,235,5,25,"Edward","Timpson","Conservative","Hold","Edward","Timpson","Conservative",3500,350,"Same MP","Edward Timpson",null,"Manufacturing Dependent",11.538461538461538,11.5,11.5,245,{"$f":"VLOOKUP(B212,'2022emp'!$A$2:$B$633,2,FALSE)","v":4000},{"$f":"VLOOKUP(B212,'2022emp'!$A$2:$F$633,4,FALSE)","v":42000},{"$f":"VLOOKUP(B212,'2022emp'!$A$2:$H$633,7,FALSE)","v":3500},{"$f":"VLOOKUP(B212,'2022emp'!$A$2:$H$633,8,FALSE)","v":400},30,9.5238095238095237,"Manufacturing Dependent",9.5]
["Scotland","Edinburgh East",1250,80000,1.5625,130,120,130,0,10,"Tommy","Sheppard","Scottish National Party","Hold","Tommy","Sheppard","Scottish National Party",1000,150,"Same MP","Tommy Sheppard",null,"Not Manufacturing Dependent",1.6025641025641024,1.6,1.6,115,{"$f":"VLOOKUP(B213,'2022emp'!$A$2:$B$633,2,FALSE)","v":1000},{"$f":"VLOOKUP(B213,'2022emp'!$A$2:$F$633,4,FALSE)","v":85000},{"$f":"VLOOKUP(B213,'2022emp'!$A$2:$H$633,7,FALSE)","v":900},{"$f":"VLOOKUP(B213,'2022emp'!$A$2:$H$633,8,FALSE)","v":175},-5,1.1764705882352942,"Not Manufacturing Dependent",1.2]
["Scotland","Edinburgh North and Leith",4000,102000,3.9215686274509802,205,180,185,20,25,"Deidre","Brock","Scottish National Party","Hold","Deidre","Brock","Scottish National Party",4000,350,"Same MP","Deidre Brock",null,"Not Manufacturing Dependent",3.6036036036036037,3.6,3.6,215,{"$f":"VLOOKUP(B214,'2022emp'!$A$2:$B$633,2,FALSE)","v":4500},{"$f":"VLOOKUP(B214,'2022emp'!$A$2:$F$633,4,FALSE)","v":108000},{"$f":"VLOOKUP(B214,'2022emp'!$A$2:$H$633,7,FALSE)","v":4000},{"$f":"VLOOKUP(B214,'2022emp'!$A$2:$H$633,8,FALSE)","v":400},35,4.1666666666666661,"Not Manufacturing Dependent",4.2]
["Scotland","Edinburgh South",225,27000,0.83333333333333337,70,55,65,5,15,"Ian","Murray","Labour","Hold","Ian","Murray","Labour",175,45,"Same MP","Ian Murray",null,"Not Manufacturing Dependent",1.8518518518518516,1.9,1.9,75,{"$f":"VLOOKUP(B215,'2022emp'!$A$2:$B$633,2,FALSE)","v":300},{"$f":"VLOOKUP(B215,'2022emp'!$A$2:$F$633,4,FALSE)","v":26000},{"$f":"VLOOKUP(B215,'2022emp'!$A$2:$H$633,7,FALSE)","v":250},{"$f":"VLOOKUP(B215,'2022emp'!$A$2:$H$633,8,FALSE)","v":50},20,1.153846153846154,"Not Manufacturing Dependent",1.2]
["Scotland","Edinburgh South West",1500,83000,1.8072289156626504,85,80,90,-5,5,"Joanna","Cherry","Scottish National Party","Hold","Joanna","Cherry","Scottish National Party",1250,150,"Same MP","Joanna Cherry",null,"Not Manufacturing Dependent",2.464788732394366,2.5,2.5,90,{"$f":"VLOOKUP(B216,'2022emp'!$A$2:$B$633,2,FALSE)","v":1750},{"$f":"VLOOKUP(B216,'2022emp'!$A$2:$F$633,4,FALSE)","v":77000},{"$f":"VLOOKUP(B216,'2022emp'!$A$2:$H$633,7,FALSE)","v":1500},{"$f":"VLOOKUP(B216,'2022emp'!$A$2:$H$633,8,FALSE)","v":175},10,2.2727272727272729,"Not Manufacturing Dependent",2.2999999999999998]
["Scotland","Edinburgh West",1000,55000,1.8181818181818181,70,70,70,0,0,"Christine","Jardine","Liberal Democrat","Hold","Christine","Jardine","Liberal Democrat",1000,75,"Same MP","Christine Jardine",null,"Not Manufacturing Dependent",1.5254237288135595,1.5,1.5,90,{"$f":"VLOOKUP(B217,'2022emp'!$A$2:$B$633,2,FALSE)","v":1250},{"$f":"VLOOKUP(B217,'2022emp'!$A$2:$F$633,4,FALSE)","v":57000},{"$f":"VLOOKUP(B217,'2022emp'!$A$2:$H$633,7,FALSE)","v":1000},{"$f":"VLOOKUP(B217,'2022emp'!$A$2:$H$633,8,FALSE)","v":150},20,2.1929824561403506,"Not Manufacturing Dependent",2.2000000000000002]
["London","Edmonton",2250,34000,6.6176470588235299,305,215,215,90,90,"Kate","Osamor","Labour/Co-operative","Hold","Kate","Osamor","Labour/Co-operative",1750,500,"Same MP","Kate Osamor",null,"Not Manufacturing Dependent",6.8181818181818175,6.8,6.8,210,{"$f":"VLOOKUP(B218,'2022emp'!$A$2:$B$633,2,FALSE)","v":2250},{"$f":"VLOOKUP(B218,'2022emp'!$A$2:$F$633,4,FALSE)","v":36000},{"$f":"VLOOKUP(B218,'2022emp'!$A$2:$H$633,7,FALSE)","v":2000},{"$f":"VLOOKUP(B218,'2022emp'!$A$2:$H$633,8,FALSE)","v":400},-5,6.25,"Not Manufacturing Dependent",6.3]
["North West","Ellesmere Port and Neston",6000,36000,16.666666666666664,155,155,155,0,0,"Justin","Madders","Labour","Hold","Justin","Madders","Labour",6000,350,"Same MP","Justin Madders",null,"Very Manufacturing Dependent",16.216216216216218,16.2,16.2,140,{"$f":"VLOOKUP(B219,'2022emp'!$A$2:$B$633,2,FALSE)","v":6000},{"$f":"VLOOKUP(B219,'2022emp'!$A$2:$F$633,4,FALSE)","v":36000},{"$f":"VLOOKUP(B219,'2022emp'!$A$2:$H$633,7,FALSE)","v":5000},{"$f":"VLOOKUP(B219,'2022emp'!$A$2:$H$633,8,FALSE)","v":250},-15,16.666666666666664,"Manufacturing Dependent",16.7]
["Yorkshire & the Humber","Elmet and Rothwell",2500,35000,7.1428571428571423,215,205,205,10,10,"Alec","Shelbrooke","Conservative","Hold","Alec","Shelbrooke","Conservative",2250,250,"Same MP","Alec Shelbrooke",null,"Not Manufacturing Dependent",7.8947368421052628,7.9,7.9,215,{"$f":"VLOOKUP(B220,'2022emp'!$A$2:$B$633,2,FALSE)","v":2500},{"$f":"VLOOKUP(B220,'2022emp'!$A$2:$F$633,4,FALSE)","v":38000},{"$f":"VLOOKUP(B220,'2022emp'!$A$2:$H$633,7,FALSE)","v":2250},{"$f":"VLOOKUP(B220,'2022emp'!$A$2:$H$633,8,FALSE)","v":250},10,6.5789473684210522,"Not Manufacturing Dependent",6.6]
["London","Eltham",125,18000,0.69444444444444442,80,75,85,-5,5,"Clive","Efford","Labour","Hold","Clive","Efford","Labour",100,30,"Same MP","Clive Efford",null,"Not Manufacturing Dependent",0.55555555555555558,0.6,0.6,70,{"$f":"VLOOKUP(B221,'2022emp'!$A$2:$B$633,2,FALSE)","v":125},{"$f":"VLOOKUP(B221,'2022emp'!$A$2:$F$633,4,FALSE)","v":20000},{"$f":"VLOOKUP(B221,'2022emp'!$A$2:$H$633,7,FALSE)","v":100},{"$f":"VLOOKUP(B221,'2022emp'!$A$2:$H$633,8,FALSE)","v":20},-5,0.625,"Not Manufacturing Dependent",0.6]
["London","Enfield North",2500,43000,5.8139534883720927,135,135,135,0,0,"Feryal","Clark","Labour","Hold","Feryal","Clark","Labour",2500,300,"Same MP","Feryal Clark",null,"Not Manufacturing Dependent",5.9523809523809517,6,6,165,{"$f":"VLOOKUP(B222,'2022emp'!$A$2:$B$633,2,FALSE)","v":2500},{"$f":"VLOOKUP(B222,'2022emp'!$A$2:$F$633,4,FALSE)","v":43000},{"$f":"VLOOKUP(B222,'2022emp'!$A$2:$H$633,7,FALSE)","v":2000},{"$f":"VLOOKUP(B222,'2022emp'!$A$2:$H$633,8,FALSE)","v":500},30,5.8139534883720927,"Not Manufacturing Dependent",5.8]
["London","Enfield, Southgate",300,28000,1.0714285714285714,130,120,125,5,10,"Bambos","Charalambous","Independent","Change","Bambos","Charalambous","Labour",225,75,"Same MP","Bambos Charalambous",null,"Not Manufacturing Dependent",1.0344827586206897,1,1,145,{"$f":"VLOOKUP(B223,'2022emp'!$A$2:$B$633,2,FALSE)","v":450},{"$f":"VLOOKUP(B223,'2022emp'!$A$2:$F$633,4,FALSE)","v":31000},{"$f":"VLOOKUP(B223,'2022emp'!$A$2:$H$633,7,FALSE)","v":350},{"$f":"VLOOKUP(B223,'2022emp'!$A$2:$H$633,8,FALSE)","v":75},25,1.4516129032258065,"Not Manufacturing Dependent",1.5]
["Eastern","Epping Forest",1250,39000,3.2051282051282048,210,185,190,20,25,"Eleanor","Laing","Conservative","Hold","Eleanor","Laing","Conservative",1000,125,"Same MP","Eleanor Laing",null,"Not Manufacturing Dependent",3.75,3.8,3.8,200,{"$f":"VLOOKUP(B224,'2022emp'!$A$2:$B$633,2,FALSE)","v":1500},{"$f":"VLOOKUP(B224,'2022emp'!$A$2:$F$633,4,FALSE)","v":41000},{"$f":"VLOOKUP(B224,'2022emp'!$A$2:$H$633,7,FALSE)","v":1250},{"$f":"VLOOKUP(B224,'2022emp'!$A$2:$H$633,8,FALSE)","v":200},15,3.6585365853658534,"Not Manufacturing Dependent",3.7]
["South East","Epsom and Ewell",300,38000,0.78947368421052633,125,130,120,5,-5,"Chris","Grayling","Conservative","Hold","Chris","Grayling","Conservative",225,45,"Same MP","Chris Grayling",null,"Not Manufacturing Dependent",0.78947368421052633,0.8,0.8,130,{"$f":"VLOOKUP(B225,'2022emp'!$A$2:$B$633,2,FALSE)","v":500},{"$f":"VLOOKUP(B225,'2022emp'!$A$2:$F$633,4,FALSE)","v":39000},{"$f":"VLOOKUP(B225,'2022emp'!$A$2:$H$633,7,FALSE)","v":450},{"$f":"VLOOKUP(B225,'2022emp'!$A$2:$H$633,8,FALSE)","v":75},0,1.2820512820512819,"Not Manufacturing Dependent",1.3]
["East Midlands","Erewash",6000,32000,18.75,380,385,375,5,-5,"Maggie","Throup","Conservative","Hold","Maggie","Throup","Conservative",5000,500,"Same MP","Maggie Throup",null,"Very Manufacturing Dependent",20,20,20,365,{"$f":"VLOOKUP(B226,'2022emp'!$A$2:$B$633,2,FALSE)","v":6000},{"$f":"VLOOKUP(B226,'2022emp'!$A$2:$F$633,4,FALSE)","v":35000},{"$f":"VLOOKUP(B226,'2022emp'!$A$2:$H$633,7,FALSE)","v":6000},{"$f":"VLOOKUP(B226,'2022emp'!$A$2:$H$633,8,FALSE)","v":700},-20,17.142857142857142,"Manufacturing Dependent",17.100000000000001]
["London","Erith and Thamesmead",3000,31000,9.67741935483871,155,145,155,0,10,"Abena","Oppong-Asare","Labour","Hold","Abena","Oppong-Asare","Labour",3000,250,"Same MP","Abena Oppong-Asare",null,"Manufacturing Dependent",8.3333333333333321,8.3000000000000007,8.3000000000000007,160,{"$f":"VLOOKUP(B227,'2022emp'!$A$2:$B$633,2,FALSE)","v":2500},{"$f":"VLOOKUP(B227,'2022emp'!$A$2:$F$633,4,FALSE)","v":32000},{"$f":"VLOOKUP(B227,'2022emp'!$A$2:$H$633,7,FALSE)","v":2500},{"$f":"VLOOKUP(B227,'2022emp'!$A$2:$H$633,8,FALSE)","v":250},15,7.8125,"Not Manufacturing Dependent",7.8]
["South East","Esher and Walton",1500,41000,3.6585365853658534,155,175,180,-25,-20,"Dominic","Raab","Conservative","Hold","Dominic","Raab","Conservative",1500,150,"Same MP","Dominic Raab",null,"Not Manufacturing Dependent",3.0487804878048781,3,3,165,{"$f":"VLOOKUP(B228,'2022emp'!$A$2:$B$633,2,FALSE)","v":1750},{"$f":"VLOOKUP(B228,'2022emp'!$A$2:$F$633,4,FALSE)","v":42000},{"$f":"VLOOKUP(B228,'2022emp'!$A$2:$H$633,7,FALSE)","v":1500},{"$f":"VLOOKUP(B228,'2022emp'!$A$2:$H$633,8,FALSE)","v":200},-10,4.1666666666666661,"Not Manufacturing Dependent",4.2]
["South West","Exeter",1250,73000,1.7123287671232876,155,150,160,-5,5,"Ben","Bradshaw","Labour","Hold","Ben","Bradshaw","Labour",1250,150,"Same MP","Ben Bradshaw",null,"Not Manufacturing Dependent",1.7361111111111112,1.7,1.7,170,{"$f":"VLOOKUP(B229,'2022emp'!$A$2:$B$633,2,FALSE)","v":1250},{"$f":"VLOOKUP(B229,'2022emp'!$A$2:$F$633,4,FALSE)","v":74000},{"$f":"VLOOKUP(B229,'2022emp'!$A$2:$H$633,7,FALSE)","v":1250},{"$f":"VLOOKUP(B229,'2022emp'!$A$2:$H$633,8,FALSE)","v":200},20,1.6891891891891893,"Not Manufacturing Dependent",1.7]
["Scotland","Falkirk",3500,46000,7.608695652173914,175,190,190,-15,-15,"John","McNally","Scottish National Party","Hold","John","McNally","Scottish National Party",3500,400,"Same MP","John McNally",null,"Not Manufacturing Dependent",8.3333333333333321,8.3000000000000007,8.3000000000000007,155,{"$f":"VLOOKUP(B230,'2022emp'!$A$2:$B$633,2,FALSE)","v":3000},{"$f":"VLOOKUP(B230,'2022emp'!$A$2:$F$633,4,FALSE)","v":48000},{"$f":"VLOOKUP(B230,'2022emp'!$A$2:$H$633,7,FALSE)","v":2500},{"$f":"VLOOKUP(B230,'2022emp'!$A$2:$H$633,8,FALSE)","v":300},-35,6.25,"Not Manufacturing Dependent",6.3]
["South East","Fareham",4000,44000,9.0909090909090917,275,285,280,-5,-10,"Suella","Braverman","Conservative","Hold","Suella","Braverman","Conservative",3500,600,"Same MP","Suella Braverman",null,"Manufacturing Dependent",10.227272727272728,10.199999999999999,10.199999999999999,245,{"$f":"VLOOKUP(B231,'2022emp'!$A$2:$B$633,2,FALSE)","v":4000},{"$f":"VLOOKUP(B231,'2022emp'!$A$2:$F$633,4,FALSE)","v":44000},{"$f":"VLOOKUP(B231,'2022emp'!$A$2:$H$633,7,FALSE)","v":3500},{"$f":"VLOOKUP(B231,'2022emp'!$A$2:$H$633,8,FALSE)","v":350},-40,9.0909090909090917,"Manufacturing Dependent",9.1]
["South East","Faversham and Mid Kent",2500,35000,7.1428571428571423,245,250,250,-5,-5,"Helen","Whately","Conservative","Hold","Helen","Whately","Conservative",2250,300,"Same MP","Helen Whately",null,"Not Manufacturing Dependent",8.3333333333333321,8.3000000000000007,8.3000000000000007,260,{"$f":"VLOOKUP(B232,'2022emp'!$A$2:$B$633,2,FALSE)","v":2250},{"$f":"VLOOKUP(B232,'2022emp'!$A$2:$F$633,4,FALSE)","v":37000},{"$f":"VLOOKUP(B232,'2022emp'!$A$2:$H$633,7,FALSE)","v":2000},{"$f":"VLOOKUP(B232,'2022emp'!$A$2:$H$633,8,FALSE)","v":350},10,6.0810810810810816,"Not Manufacturing Dependent",6.1]
["London","Feltham and Heston",2500,52000,4.8076923076923084,145,140,145,0,5,"Seema","Malhotra","Labour/Co-operative","Hold","Seema","Malhotra","Labour/Co-operative",2250,350,"Same MP","Seema Malhotra",null,"Not Manufacturing Dependent",3.8461538461538463,3.8,3.8,170,{"$f":"VLOOKUP(B233,'2022emp'!$A$2:$B$633,2,FALSE)","v":1750},{"$f":"VLOOKUP(B233,'2022emp'!$A$2:$F$633,4,FALSE)","v":52000},{"$f":"VLOOKUP(B233,'2022emp'!$A$2:$H$633,7,FALSE)","v":1500},{"$f":"VLOOKUP(B233,'2022emp'!$A$2:$H$633,8,FALSE)","v":200},30,3.3653846153846154,"Not Manufacturing Dependent",3.4]
["Northern Ireland","Fermanagh & South Tyrone",null,null,{"$error":"#DIV/0!"},410,370,390,20,40,"Michelle","Gildernew","Sinn Fein","Hold","Michelle","Gildernew","Sinn Fein",null,null,"Same MP","Michelle Gildernew",null,{"$error":"#DIV/0!"},22.819472616632861,22.8,22.8,430,{"$f":"VLOOKUP(B234,'2022emp'!$A$2:$B$633,2,FALSE)","v":{"$error":"#N/A"}},{"$f":"VLOOKUP(B234,'2022emp'!$A$2:$F$633,4,FALSE)","v":{"$error":"#N/A"}},{"$f":"VLOOKUP(B234,'2022emp'!$A$2:$H$633,7,FALSE)","v":{"$error":"#N/A"}},{"$f":"VLOOKUP(B234,'2022emp'!$A$2:$H$633,8,FALSE)","v":{"$error":"#N/A"}},60,null,"Not Manufacturing Dependent",0]
["South West","Filton and Bradley Stoke",11000,93000,11.827956989247312,140,135,130,10,5,"Jack","Lopresti","Conservative","Hold","Jack","Lopresti","Conservative",11000,500,"Same MP","Jack Lopresti",null,"Manufacturing Dependent",12.359550561797752,12.4,12.4,105,{"$f":"VLOOKUP(B235,'2022emp'!$A$2:$B$633,2,FALSE)","v":11000},{"$f":"VLOOKUP(B235,'2022emp'!$A$2:$F$633,4,FALSE)","v":98000},{"$f":"VLOOKUP(B235,'2022emp'!$A$2:$H$633,7,FALSE)","v":11000},{"$f":"VLOOKUP(B235,'2022emp'!$A$2:$H$633,8,FALSE)","v":350},-30,11.224489795918368,"Manufacturing Dependent",11.2]
["London","Finchley and Golders Green",900,46000,1.956521739130435,245,235,215,30,10,"Mike","Freer","Conservative","Hold","Mike","Freer","Conservative",700,175,"Same MP","Mike Freer",null,"Not Manufacturing Dependent",1.6326530612244898,1.6,1.6,280,{"$f":"VLOOKUP(B236,'2022emp'!$A$2:$B$633,2,FALSE)","v":700},{"$f":"VLOOKUP(B236,'2022emp'!$A$2:$F$633,4,FALSE)","v":53000},{"$f":"VLOOKUP(B236,'2022emp'!$A$2:$H$633,7,FALSE)","v":600},{"$f":"VLOOKUP(B236,'2022emp'!$A$2:$H$633,8,FALSE)","v":125},45,1.3207547169811322,"Not Manufacturing Dependent",1.3]
["South East","Folkestone and Hythe",2500,39000,6.4102564102564097,210,185,190,20,25,"Damian","Collins","Conservative","Hold","Damian","Collins","Conservative",2000,300,"Same MP","Damian Collins",null,"Not Manufacturing Dependent",5.4054054054054053,5.4,5.4,210,{"$f":"VLOOKUP(B237,'2022emp'!$A$2:$B$633,2,FALSE)","v":2000},{"$f":"VLOOKUP(B237,'2022emp'!$A$2:$F$633,4,FALSE)","v":41000},{"$f":"VLOOKUP(B237,'2022emp'!$A$2:$H$633,7,FALSE)","v":1750},{"$f":"VLOOKUP(B237,'2022emp'!$A$2:$H$633,8,FALSE)","v":225},25,4.8780487804878048,"Not Manufacturing Dependent",4.9000000000000004]
["South West","Forest of Dean",4500,26000,17.307692307692307,305,270,285,20,35,"Mark","Harper","Conservative","Hold","Mark","Harper","Conservative",4000,450,"Same MP","Mark Harper",null,"Very Manufacturing Dependent",16,16,16,295,{"$f":"VLOOKUP(B238,'2022emp'!$A$2:$B$633,2,FALSE)","v":4000},{"$f":"VLOOKUP(B238,'2022emp'!$A$2:$F$633,4,FALSE)","v":25000},{"$f":"VLOOKUP(B238,'2022emp'!$A$2:$H$633,7,FALSE)","v":3500},{"$f":"VLOOKUP(B238,'2022emp'!$A$2:$H$633,8,FALSE)","v":350},25,16,"Manufacturing Dependent",16]
["Northern Ireland","Foyle",null,null,{"$error":"#DIV/0!"},150,140,145,5,10,"Colum","Eastwood","Social Democratic and Labour Party","Hold","Colum","Eastwood","Social Democratic and Labour Party",null,null,"Same MP","Colum Eastwood",null,{"$error":"#DIV/0!"},9.4014720177753084,9.4,9.4,155,{"$f":"VLOOKUP(B239,'2022emp'!$A$2:$B$633,2,FALSE)","v":{"$error":"#N/A"}},{"$f":"VLOOKUP(B239,'2022emp'!$A$2:$F$633,4,FALSE)","v":{"$error":"#N/A"}},{"$f":"VLOOKUP(B239,'2022emp'!$A$2:$H$633,7,FALSE)","v":{"$error":"#N/A"}},{"$f":"VLOOKUP(B239,'2022emp'!$A$2:$H$633,8,FALSE)","v":{"$error":"#N/A"}},15,null,"Not Manufacturing Dependent",0]
["North West","Fylde",10000,39000,25.641025641025639,190,175,170,20,15,"Mark","Menzies","Conservative","Hold","Mark","Menzies","Conservative",9000,600,"Same MP","Mark Menzies",null,"Extremely Manufacturing Dependent",25.641025641025639,25.6,25.6,180,{"$f":"VLOOKUP(B240,'2022emp'!$A$2:$B$633,2,FALSE)","v":10000},{"$f":"VLOOKUP(B240,'2022emp'!$A$2:$F$633,4,FALSE)","v":41000},{"$f":"VLOOKUP(B240,'2022emp'!$A$2:$H$633,7,FALSE)","v":9000},{"$f":"VLOOKUP(B240,'2022emp'!$A$2:$H$633,8,FALSE)","v":600},5,24.390243902439025,"Very Manufacturing Dependent",24.4]
["East Midlands","Gainsborough",3500,27000,12.962962962962962,230,215,220,10,15,"Edward","Leigh","Conservative","Hold","Edward","Leigh","Conservative",3000,250,"Same MP","Edward Leigh",null,"Manufacturing Dependent",14.000000000000002,14,14,220,{"$f":"VLOOKUP(B241,'2022emp'!$A$2:$B$633,2,FALSE)","v":3500},{"$f":"VLOOKUP(B241,'2022emp'!$A$2:$F$633,4,FALSE)","v":27000},{"$f":"VLOOKUP(B241,'2022emp'!$A$2:$H$633,7,FALSE)","v":3000},{"$f":"VLOOKUP(B241,'2022emp'!$A$2:$H$633,8,FALSE)","v":300},5,12.962962962962962,"Manufacturing Dependent",13]
["North West","Garston and Halewood",10000,47000,21.276595744680851,170,155,160,10,15,"Maria","Eagle","Labour","Hold","Maria","Eagle","Labour",9000,500,"Same MP","Maria Eagle",null,"Very Manufacturing Dependent",22.916666666666664,22.9,22.9,150,{"$f":"VLOOKUP(B242,'2022emp'!$A$2:$B$633,2,FALSE)","v":9000},{"$f":"VLOOKUP(B242,'2022emp'!$A$2:$F$633,4,FALSE)","v":46000},{"$f":"VLOOKUP(B242,'2022emp'!$A$2:$H$633,7,FALSE)","v":8000},{"$f":"VLOOKUP(B242,'2022emp'!$A$2:$H$633,8,FALSE)","v":350},-5,19.565217391304348,"Very Manufacturing Dependent",19.600000000000001]
["North East","Gateshead",6000,55000,10.909090909090908,185,170,170,15,15,"Ian","Mearns","Labour","Hold","Ian","Mearns","Labour",5000,225,"Same MP","Ian Mearns",null,"Manufacturing Dependent",10.714285714285714,10.7,10.7,165,{"$f":"VLOOKUP(B243,'2022emp'!$A$2:$B$633,2,FALSE)","v":6000},{"$f":"VLOOKUP(B243,'2022emp'!$A$2:$F$633,4,FALSE)","v":56000},{"$f":"VLOOKUP(B243,'2022emp'!$A$2:$H$633,7,FALSE)","v":5000},{"$f":"VLOOKUP(B243,'2022emp'!$A$2:$H$633,8,FALSE)","v":400},-5,10.714285714285714,"Manufacturing Dependent",10.7]
["East Midlands","Gedling",3000,24000,12.5,160,155,160,0,5,"Tom","Randall","Conservative","Hold","Tom","Randall","Conservative",3000,300,"Same MP","Tom Randall",null,"Manufacturing Dependent",12,12,12,150,{"$f":"VLOOKUP(B244,'2022emp'!$A$2:$B$633,2,FALSE)","v":3000},{"$f":"VLOOKUP(B244,'2022emp'!$A$2:$F$633,4,FALSE)","v":26000},{"$f":"VLOOKUP(B244,'2022emp'!$A$2:$H$633,7,FALSE)","v":2500},{"$f":"VLOOKUP(B244,'2022emp'!$A$2:$H$633,8,FALSE)","v":250},-5,11.538461538461538,"Manufacturing Dependent",11.5]
["South East","Gillingham and Rainham",2000,31000,6.4516129032258061,130,120,125,5,10,"Rehman","Chishti","Conservative","Hold","Rehman","Chishti","Conservative",1750,175,"Same MP","Rehman Chishti",null,"Not Manufacturing Dependent",6.0344827586206895,6,6,120,{"$f":"VLOOKUP(B245,'2022emp'!$A$2:$B$633,2,FALSE)","v":1750},{"$f":"VLOOKUP(B245,'2022emp'!$A$2:$F$633,4,FALSE)","v":30000},{"$f":"VLOOKUP(B245,'2022emp'!$A$2:$H$633,7,FALSE)","v":1750},{"$f":"VLOOKUP(B245,'2022emp'!$A$2:$H$633,8,FALSE)","v":200},0,5.833333333333333,"Not Manufacturing Dependent",5.8]
["Scotland","Glasgow Central",3500,222000,1.5765765765765765,310,280,285,25,30,"Alison","Thewliss","Scottish National Party","Hold","Alison","Thewliss","Scottish National Party",3000,400,"Same MP","Alison Thewliss",null,"Not Manufacturing Dependent",1.7857142857142856,1.8,1.8,330,{"$f":"VLOOKUP(B246,'2022emp'!$A$2:$B$633,2,FALSE)","v":3500},{"$f":"VLOOKUP(B246,'2022emp'!$A$2:$F$633,4,FALSE)","v":240000},{"$f":"VLOOKUP(B246,'2022emp'!$A$2:$H$633,7,FALSE)","v":3000},{"$f":"VLOOKUP(B246,'2022emp'!$A$2:$H$633,8,FALSE)","v":450},50,1.4583333333333333,"Not Manufacturing Dependent",1.5]
["Scotland","Glasgow East",4000,34000,11.76470588235294,145,145,145,0,0,"David","Linden","Scottish National Party","Hold","David","Linden","Scottish National Party",3500,350,"Same MP","David Linden",null,"Manufacturing Dependent",10,10,10,130,{"$f":"VLOOKUP(B247,'2022emp'!$A$2:$B$633,2,FALSE)","v":3000},{"$f":"VLOOKUP(B247,'2022emp'!$A$2:$F$633,4,FALSE)","v":36000},{"$f":"VLOOKUP(B247,'2022emp'!$A$2:$H$633,7,FALSE)","v":3000},{"$f":"VLOOKUP(B247,'2022emp'!$A$2:$H$633,8,FALSE)","v":300},-15,8.3333333333333321,"Not Manufacturing Dependent",8.3000000000000007]
["Scotland","Glasgow North",1000,29000,3.4482758620689653,85,90,90,-5,-5,"Patrick","Grady","Scottish National Party","Hold","Patrick","Grady","Scottish National Party",800,125,"Same MP","Patrick Grady",null,"Not Manufacturing Dependent",3.3333333333333335,3.3,3.3,95,{"$f":"VLOOKUP(B248,'2022emp'!$A$2:$B$633,2,FALSE)","v":1000},{"$f":"VLOOKUP(B248,'2022emp'!$A$2:$F$633,4,FALSE)","v":30000},{"$f":"VLOOKUP(B248,'2022emp'!$A$2:$H$633,7,FALSE)","v":900},{"$f":"VLOOKUP(B248,'2022emp'!$A$2:$H$633,8,FALSE)","v":125},5,3.3333333333333335,"Not Manufacturing Dependent",3.3]
["Scotland","Glasgow North East",2500,37000,6.756756756756757,105,105,115,-10,0,"Anne","McLaughlin","Scottish National Party","Hold","Anne","McLaughlin","Scottish National Party",2500,175,"Same MP","Anne McLaughlin",null,"Not Manufacturing Dependent",6.5789473684210522,6.6,6.6,85,{"$f":"VLOOKUP(B249,'2022emp'!$A$2:$B$633,2,FALSE)","v":2500},{"$f":"VLOOKUP(B249,'2022emp'!$A$2:$F$633,4,FALSE)","v":38000},{"$f":"VLOOKUP(B249,'2022emp'!$A$2:$H$633,7,FALSE)","v":2250},{"$f":"VLOOKUP(B249,'2022emp'!$A$2:$H$633,8,FALSE)","v":200},-20,6.5789473684210522,"Not Manufacturing Dependent",6.6]
["Scotland","Glasgow North West",3500,25000,14.000000000000002,70,75,75,-5,-5,"Carol","Monaghan","Scottish National Party","Hold","Carol","Monaghan","Scottish National Party",3000,225,"Same MP","Carol Monaghan",null,"Manufacturing Dependent",14.000000000000002,14,14,60,{"$f":"VLOOKUP(B250,'2022emp'!$A$2:$B$633,2,FALSE)","v":3000},{"$f":"VLOOKUP(B250,'2022emp'!$A$2:$F$633,4,FALSE)","v":26000},{"$f":"VLOOKUP(B250,'2022emp'!$A$2:$H$633,7,FALSE)","v":3000},{"$f":"VLOOKUP(B250,'2022emp'!$A$2:$H$633,8,FALSE)","v":175},-15,11.538461538461538,"Manufacturing Dependent",11.5]
["Scotland","Glasgow South",900,15000,6,85,65,75,10,20,"Stewart","McDonald","Scottish National Party","Hold","Stewart","McDonald","Scottish National Party",700,200,"Same MP","Stewart McDonald",null,"Not Manufacturing Dependent",6,6,6,80,{"$f":"VLOOKUP(B251,'2022emp'!$A$2:$B$633,2,FALSE)","v":800},{"$f":"VLOOKUP(B251,'2022emp'!$A$2:$F$633,4,FALSE)","v":16000},{"$f":"VLOOKUP(B251,'2022emp'!$A$2:$H$633,7,FALSE)","v":800},{"$f":"VLOOKUP(B251,'2022emp'!$A$2:$H$633,8,FALSE)","v":75},15,5,"Not Manufacturing Dependent",5]
["Scotland","Glasgow South West",3000,45000,6.666666666666667,105,115,110,-5,-10,"Chris","Stephens","Scottish National Party","Hold","Chris","Stephens","Scottish National Party",3000,200,"Same MP","Chris Stephens",null,"Not Manufacturing Dependent",6.666666666666667,6.7,6.7,100,{"$f":"VLOOKUP(B252,'2022emp'!$A$2:$B$633,2,FALSE)","v":3500},{"$f":"VLOOKUP(B252,'2022emp'!$A$2:$F$633,4,FALSE)","v":46000},{"$f":"VLOOKUP(B252,'2022emp'!$A$2:$H$633,7,FALSE)","v":3500},{"$f":"VLOOKUP(B252,'2022emp'!$A$2:$H$633,8,FALSE)","v":200},-15,7.608695652173914,"Not Manufacturing Dependent",7.6]
["Scotland","Glenrothes",6000,33000,18.181818181818183,180,185,190,-10,-5,"Peter","Grant","Scottish National Party","Hold","Peter","Grant","Scottish National Party",5000,500,"Same MP","Peter Grant",null,"Very Manufacturing Dependent",18.181818181818183,18.2,18.2,170,{"$f":"VLOOKUP(B253,'2022emp'!$A$2:$B$633,2,FALSE)","v":6000},{"$f":"VLOOKUP(B253,'2022emp'!$A$2:$F$633,4,FALSE)","v":31000},{"$f":"VLOOKUP(B253,'2022emp'!$A$2:$H$633,7,FALSE)","v":5000},{"$f":"VLOOKUP(B253,'2022emp'!$A$2:$H$633,8,FALSE)","v":500},-15,19.35483870967742,"Very Manufacturing Dependent",19.399999999999999]
["South West","Gloucester",4000,64000,6.25,235,220,220,15,15,"Richard","Graham","Conservative","Hold","Richard","Graham","Conservative",3500,450,"Same MP","Richard Graham",null,"Not Manufacturing Dependent",6.4516129032258061,6.5,6.5,235,{"$f":"VLOOKUP(B254,'2022emp'!$A$2:$B$633,2,FALSE)","v":4000},{"$f":"VLOOKUP(B254,'2022emp'!$A$2:$F$633,4,FALSE)","v":64000},{"$f":"VLOOKUP(B254,'2022emp'!$A$2:$H$633,7,FALSE)","v":3500},{"$f":"VLOOKUP(B254,'2022emp'!$A$2:$H$633,8,FALSE)","v":450},15,6.25,"Not Manufacturing Dependent",6.3]
["Scotland","Gordon",8000,56000,14.285714285714285,320,305,300,20,15,"Richard","Thomson","Scottish National Party","Hold","Richard Gordon","Thomson","Scottish National Party",7000,700,"Same MP","Richard Thomson",null,"Manufacturing Dependent",12.698412698412698,12.7,12.7,300,{"$f":"VLOOKUP(B255,'2022emp'!$A$2:$B$633,2,FALSE)","v":7000},{"$f":"VLOOKUP(B255,'2022emp'!$A$2:$F$633,4,FALSE)","v":58000},{"$f":"VLOOKUP(B255,'2022emp'!$A$2:$H$633,7,FALSE)","v":7000},{"$f":"VLOOKUP(B255,'2022emp'!$A$2:$H$633,8,FALSE)","v":800},-5,12.068965517241379,"Manufacturing Dependent",12.1]
["South East","Gosport",2500,23000,10.869565217391305,190,205,195,-5,-15,"Caroline","Dinenage","Conservative","Hold","Caroline","Dinenage","Conservative",2250,300,"Same MP","Caroline Dinenage",null,"Manufacturing Dependent",12.5,12.5,12.5,170,{"$f":"VLOOKUP(B256,'2022emp'!$A$2:$B$633,2,FALSE)","v":2500},{"$f":"VLOOKUP(B256,'2022emp'!$A$2:$F$633,4,FALSE)","v":23000},{"$f":"VLOOKUP(B256,'2022emp'!$A$2:$H$633,7,FALSE)","v":2250},{"$f":"VLOOKUP(B256,'2022emp'!$A$2:$H$633,8,FALSE)","v":225},-35,10.869565217391305,"Manufacturing Dependent",10.9]
["Wales","Gower",2000,19000,10.526315789473683,175,155,150,25,20,"Tonia","Antoniazzi","Labour","Hold","Tonia","Antoniazzi","Labour",2000,175,"Same MP","Tonia Antoniazzi",null,"Manufacturing Dependent",7.8947368421052628,7.9,7.9,120,{"$f":"VLOOKUP(B257,'2022emp'!$A$2:$B$633,2,FALSE)","v":1250},{"$f":"VLOOKUP(B257,'2022emp'!$A$2:$F$633,4,FALSE)","v":18000},{"$f":"VLOOKUP(B257,'2022emp'!$A$2:$H$633,7,FALSE)","v":1250},{"$f":"VLOOKUP(B257,'2022emp'!$A$2:$H$633,8,FALSE)","v":100},-35,6.9444444444444446,"Not Manufacturing Dependent",6.9]
["East Midlands","Grantham and Stamford",4500,43000,10.465116279069768,265,245,245,20,20,"Gareth","Davies","Conservative","Hold","Gareth","Davies","Conservative",4500,350,"Same MP","Gareth Davies",null,"Manufacturing Dependent",13.333333333333334,13.3,13.3,260,{"$f":"VLOOKUP(B258,'2022emp'!$A$2:$B$633,2,FALSE)","v":5000},{"$f":"VLOOKUP(B258,'2022emp'!$A$2:$F$633,4,FALSE)","v":48000},{"$f":"VLOOKUP(B258,'2022emp'!$A$2:$H$633,7,FALSE)","v":4500},{"$f":"VLOOKUP(B258,'2022emp'!$A$2:$H$633,8,FALSE)","v":300},15,10.416666666666668,"Manufacturing Dependent",10.4]
["South East","Gravesham",1750,33000,5.3030303030303028,190,195,200,-10,-5,"Adam","Holloway","Conservative","Hold","Adam","Holloway","Conservative",1750,175,"Same MP","Adam Holloway",null,"Not Manufacturing Dependent",6.25,6.3,6.3,195,{"$f":"VLOOKUP(B259,'2022emp'!$A$2:$B$633,2,FALSE)","v":1750},{"$f":"VLOOKUP(B259,'2022emp'!$A$2:$F$633,4,FALSE)","v":33000},{"$f":"VLOOKUP(B259,'2022emp'!$A$2:$H$633,7,FALSE)","v":1500},{"$f":"VLOOKUP(B259,'2022emp'!$A$2:$H$633,8,FALSE)","v":150},0,5.3030303030303028,"Not Manufacturing Dependent",5.3]
["Yorkshire & the Humber","Great Grimsby",7000,39000,17.948717948717949,180,190,190,-10,-10,"Lia","Nici","Conservative","Hold","Lia","Nici","Conservative",6000,800,"Same MP","Lia Nici",null,"Very Manufacturing Dependent",17.5,17.5,17.5,180,{"$f":"VLOOKUP(B260,'2022emp'!$A$2:$B$633,2,FALSE)","v":7000},{"$f":"VLOOKUP(B260,'2022emp'!$A$2:$F$633,4,FALSE)","v":41000},{"$f":"VLOOKUP(B260,'2022emp'!$A$2:$H$633,7,FALSE)","v":6000},{"$f":"VLOOKUP(B260,'2022emp'!$A$2:$H$633,8,FALSE)","v":800},-10,17.073170731707318,"Manufacturing Dependent",17.100000000000001]
["Eastern","Great Yarmouth",2500,37000,6.756756756756757,195,190,200,-5,5,"Brandon","Lewis","Conservative","Hold","Brandon","Lewis","Conservative",2250,250,"Same MP","Brandon Lewis",null,"Not Manufacturing Dependent",6.756756756756757,6.8,6.8,175,{"$f":"VLOOKUP(B261,'2022emp'!$A$2:$B$633,2,FALSE)","v":3000},{"$f":"VLOOKUP(B261,'2022emp'!$A$2:$F$633,4,FALSE)","v":37000},{"$f":"VLOOKUP(B261,'2022emp'!$A$2:$H$633,7,FALSE)","v":2500},{"$f":"VLOOKUP(B261,'2022emp'!$A$2:$H$633,8,FALSE)","v":400},-15,8.1081081081081088,"Not Manufacturing Dependent",8.1]
["London","Greenwich and Woolwich",2000,56000,3.5714285714285712,190,175,175,15,15,"Matthew","Pennycook","Labour","Hold","Matthew","Pennycook","Labour",1750,250,"Same MP","Matthew Pennycook",null,"Not Manufacturing Dependent",3.5714285714285712,3.6,3.6,200,{"$f":"VLOOKUP(B262,'2022emp'!$A$2:$B$633,2,FALSE)","v":2250},{"$f":"VLOOKUP(B262,'2022emp'!$A$2:$F$633,4,FALSE)","v":57000},{"$f":"VLOOKUP(B262,'2022emp'!$A$2:$H$633,7,FALSE)","v":2000},{"$f":"VLOOKUP(B262,'2022emp'!$A$2:$H$633,8,FALSE)","v":225},25,3.9473684210526314,"Not Manufacturing Dependent",3.9]
["South East","Guildford",4500,70000,6.4285714285714279,175,180,180,-5,-5,"Angela","Richardson","Conservative","Hold","Angela Joy","Richardson","Conservative",4000,500,"Same MP","Angela Richardson",null,"Not Manufacturing Dependent",5.4794520547945202,5.5,5.5,170,{"$f":"VLOOKUP(B263,'2022emp'!$A$2:$B$633,2,FALSE)","v":3500},{"$f":"VLOOKUP(B263,'2022emp'!$A$2:$F$633,4,FALSE)","v":74000},{"$f":"VLOOKUP(B263,'2022emp'!$A$2:$H$633,7,FALSE)","v":3500},{"$f":"VLOOKUP(B263,'2022emp'!$A$2:$H$633,8,FALSE)","v":225},-10,4.7297297297297298,"Not Manufacturing Dependent",4.7]
["London","Hackney North and Stoke Newington",800,31000,2.5806451612903225,210,200,195,15,10,"Diane","Abbott","Independent","Change","Diane","Abbott","Labour",500,225,"Same MP","Diane Abbott",null,"Not Manufacturing Dependent",2.5806451612903225,2.6,2.6,220,{"$f":"VLOOKUP(B264,'2022emp'!$A$2:$B$633,2,FALSE)","v":900},{"$f":"VLOOKUP(B264,'2022emp'!$A$2:$F$633,4,FALSE)","v":36000},{"$f":"VLOOKUP(B264,'2022emp'!$A$2:$H$633,7,FALSE)","v":700},{"$f":"VLOOKUP(B264,'2022emp'!$A$2:$H$633,8,FALSE)","v":200},20,2.5,"Not Manufacturing Dependent",2.5]
["London","Hackney South and Shoreditch",1750,101000,1.7326732673267329,515,410,435,{"$f":"F265-H265","v":80},{"$f":"F265-G265","v":105},"Meg","Hillier","Labour/Co-operative","Hold","Meg","Hillier","Labour/Co-operative",1500,400,"Same MP",{"$f":"CONCATENATE(K265,\" \",L265)","v":"Meg Hillier"},null,{"$f":"IF(E265>24.29, \"Extremely Manufacturing Dependent\", IF(E265>16.59, \"Very Manufacturing Dependent\", IF(E265>8.09, \"Manufacturing Dependent\", \"Not Manufacturing Dependent\")))","v":"Not Manufacturing Dependent"},1.8421052631578945,1.8,1.8,540,{"$f":"VLOOKUP(B265,'2022emp'!$A$2:$B$633,2,FALSE)","v":2250},{"$f":"VLOOKUP(B265,'2022emp'!$A$2:$F$633,4,FALSE)","v":131000},{"$f":"VLOOKUP(B265,'2022emp'!$A$2:$H$633,7,FALSE)","v":1750},{"$f":"VLOOKUP(B265,'2022emp'!$A$2:$H$633,8,FALSE)","v":400},130,1.717557251908397,"Not Manufacturing Dependent",1.7]
["West Midlands","Halesowen and Rowley Regis",4500,29000,15.517241379310345,330,320,325,5,10,"James","Morris","Conservative",{"$f":"IF(M266=Q266, \"Hold\", \"Change\")","v":"Hold"},"James","Morris","Conservative",4000,400,{"$f":"IF(L266=P266, \"Same MP\", \"New MP\")","v":"Same MP"},"James Morris",null,"Manufacturing Dependent",17.241379310344829,{"$f":"ROUND(X266,1)","v":17.2},17.2,330,{"$f":"VLOOKUP(B266,'2022emp'!$A$2:$B$633,2,FALSE)","v":4500},{"$f":"VLOOKUP(B266,'2022emp'!$A$2:$F$633,4,FALSE)","v":27000},{"$f":"VLOOKUP(B266,'2022emp'!$A$2:$H$633,7,FALSE)","v":4000},{"$f":"VLOOKUP(B266,'2022emp'!$A$2:$H$633,8,FALSE)","v":500},{"$f":"AA266-G266","v":10},{"$f":"(AB266/AC266)*100","v":16.666666666666664},{"$f":"IF(AG266>26.79, \"Extremely Manufacturing Dependent\", IF(AG266>17.86, \"Very Manufacturing Dependent\", IF(AG266>8.93, \"Manufacturing Dependent\", \"Not Manufacturing Dependent\")))","v":"Manufacturing Dependent"},{"$f":"ROUND(AG266,1)","v":16.7}]
["Yorkshire & the Humber","Halifax",4500,44000,{"$f":"(C267/D267)*100","v":10.227272727272728},275,275,280,-5,0,"Holly","Lynch","Labour","Hold","Holly","Lynch","Labour",4000,350,"Same MP","Holly Lynch",null,"Manufacturing Dependent",10.869565217391305,10.9,10.9,270,{"$f":"VLOOKUP(B267,'2022emp'!$A$2:$B$633,2,FALSE)","v":4000},{"$f":"VLOOKUP(B267,'2022emp'!$A$2:$F$633,4,FALSE)","v":46000},{"$f":"VLOOKUP(B267,'2022emp'!$A$2:$H$633,7,FALSE)","v":4000},{"$f":"VLOOKUP(B267,'2022emp'!$A$2:$H$633,8,FALSE)","v":400},-5,8.695652173913043,"Not Manufacturing Dependent",8.6999999999999993]
["Yorkshire & the Humber","Haltemprice and Howden",6000,33000,18.181818181818183,245,225,230,15,20,"David","Davis","Conservative","Hold","David","Davis","Conservative",6000,450,"Same MP","David Davis",null,"Very Manufacturing Dependent",17.647058823529413,17.600000000000001,17.600000000000001,220,{"$f":"VLOOKUP(B268,'2022emp'!$A$2:$B$633,2,FALSE)","v":7000},{"$f":"VLOOKUP(B268,'2022emp'!$A$2:$F$633,4,FALSE)","v":37000},{"$f":"VLOOKUP(B268,'2022emp'!$A$2:$H$633,7,FALSE)","v":7000},{"$f":"VLOOKUP(B268,'2022emp'!$A$2:$H$633,8,FALSE)","v":350},-5,18.918918918918919,"Very Manufacturing Dependent",18.899999999999999]
["North West","Halton",4000,34000,11.76470588235294,200,220,210,-10,-20,"Derek","Twigg","Labour","Hold","Derek","Twigg","Labour",3500,250,"Same MP","Derek Twigg",null,"Manufacturing Dependent",11.76470588235294,11.8,11.8,195,{"$f":"VLOOKUP(B269,'2022emp'!$A$2:$B$633,2,FALSE)","v":4000},{"$f":"VLOOKUP(B269,'2022emp'!$A$2:$F$633,4,FALSE)","v":38000},{"$f":"VLOOKUP(B269,'2022emp'!$A$2:$H$633,7,FALSE)","v":3500},{"$f":"VLOOKUP(B269,'2022emp'!$A$2:$H$633,8,FALSE)","v":350},-25,10.526315789473683,"Manufacturing Dependent",10.5]
["London","Hammersmith",1500,107000,1.4018691588785046,185,175,190,-5,10,"Andrew","Slaughter","Labour","Hold","Andrew","Slaughter","Labour",1500,150,"Same MP","Andrew Slaughter",null,"Not Manufacturing Dependent",1.179245283018868,1.2,1.2,170,{"$f":"VLOOKUP(B270,'2022emp'!$A$2:$B$633,2,FALSE)","v":1500},{"$f":"VLOOKUP(B270,'2022emp'!$A$2:$F$633,4,FALSE)","v":116000},{"$f":"VLOOKUP(B270,'2022emp'!$A$2:$H$633,7,FALSE)","v":1500},{"$f":"VLOOKUP(B270,'2022emp'!$A$2:$H$633,8,FALSE)","v":125},-5,1.2931034482758621,"Not Manufacturing Dependent",1.3]
["London","Hampstead and Kilburn",600,46000,1.3043478260869565,185,170,175,10,15,"Tulip","Siddiq","Labour","Hold","Tulip","Siddiq","Labour",500,100,"Same MP","Tulip Siddiq",null,"Not Manufacturing Dependent",1.0416666666666665,1,1,190,{"$f":"VLOOKUP(B271,'2022emp'!$A$2:$B$633,2,FALSE)","v":600},{"$f":"VLOOKUP(B271,'2022emp'!$A$2:$F$633,4,FALSE)","v":53000},{"$f":"VLOOKUP(B271,'2022emp'!$A$2:$H$633,7,FALSE)","v":450},{"$f":"VLOOKUP(B271,'2022emp'!$A$2:$H$633,8,FALSE)","v":125},20,1.1320754716981132,"Not Manufacturing Dependent",1.1000000000000001]
["East Midlands","Harborough",4000,36000,11.111111111111111,345,330,340,5,15,"Neil","O'Brien","Conservative","Hold","Neil","O'Brien","Conservative",3500,350,"Same MP","Neil O'Brien",null,"Manufacturing Dependent",11.842105263157894,11.8,11.8,325,{"$f":"VLOOKUP(B272,'2022emp'!$A$2:$B$633,2,FALSE)","v":4000},{"$f":"VLOOKUP(B272,'2022emp'!$A$2:$F$633,4,FALSE)","v":38000},{"$f":"VLOOKUP(B272,'2022emp'!$A$2:$H$633,7,FALSE)","v":3500},{"$f":"VLOOKUP(B272,'2022emp'!$A$2:$H$633,8,FALSE)","v":450},-5,10.526315789473683,"Manufacturing Dependent",10.5]
["Eastern","Harlow",3000,45000,6.666666666666667,275,270,275,0,5,"Robert","Halfon","Conservative","Hold","Robert","Halfon","Conservative",3000,300,"Same MP","Robert Halfon",null,"Not Manufacturing Dependent",7.608695652173914,7.6,7.6,270,{"$f":"VLOOKUP(B273,'2022emp'!$A$2:$B$633,2,FALSE)","v":3500},{"$f":"VLOOKUP(B273,'2022emp'!$A$2:$F$633,4,FALSE)","v":46000},{"$f":"VLOOKUP(B273,'2022emp'!$A$2:$H$633,7,FALSE)","v":3000},{"$f":"VLOOKUP(B273,'2022emp'!$A$2:$H$633,8,FALSE)","v":400},0,7.608695652173914,"Not Manufacturing Dependent",7.6]
["Yorkshire & the Humber","Harrogate and Knaresborough",2500,50000,5,215,205,220,-5,10,"Andrew","Jones","Conservative","Hold","Andrew","Jones","Conservative",2000,350,"Same MP","Andrew Jones",null,"Not Manufacturing Dependent",4.6296296296296298,4.5999999999999996,4.5999999999999996,210,{"$f":"VLOOKUP(B274,'2022emp'!$A$2:$B$633,2,FALSE)","v":3000},{"$f":"VLOOKUP(B274,'2022emp'!$A$2:$F$633,4,FALSE)","v":53000},{"$f":"VLOOKUP(B274,'2022emp'!$A$2:$H$633,7,FALSE)","v":2500},{"$f":"VLOOKUP(B274,'2022emp'!$A$2:$H$633,8,FALSE)","v":350},5,5.6603773584905666,"Not Manufacturing Dependent",5.7]
["London","Harrow East",1250,26000,4.8076923076923084,140,150,160,-20,-10,"Bob","Blackman","Conservative","Hold","Bob","Blackman","Conservative",1250,125,"Same MP","Bob Blackman",null,"Not Manufacturing Dependent",4.8076923076923084,4.8,4.8,125,{"$f":"VLOOKUP(B275,'2022emp'!$A$2:$B$633,2,FALSE)","v":1250},{"$f":"VLOOKUP(B275,'2022emp'!$A$2:$F$633,4,FALSE)","v":29000},{"$f":"VLOOKUP(B275,'2022emp'!$A$2:$H$633,7,FALSE)","v":1250},{"$f":"VLOOKUP(B275,'2022emp'!$A$2:$H$633,8,FALSE)","v":200},-25,4.3103448275862073,"Not Manufacturing Dependent",4.3]
["London","Harrow West",400,35000,1.1428571428571428,140,150,140,0,-10,"Gareth","Thomas","Labour/Co-operative","Hold","Gareth","Thomas","Labour/Co-operative",300,75,"Same MP","Gareth Thomas",null,"Not Manufacturing Dependent",1.0810810810810811,1.1000000000000001,1.1000000000000001,140,{"$f":"VLOOKUP(B276,'2022emp'!$A$2:$B$633,2,FALSE)","v":450},{"$f":"VLOOKUP(B276,'2022emp'!$A$2:$F$633,4,FALSE)","v":39000},{"$f":"VLOOKUP(B276,'2022emp'!$A$2:$H$633,7,FALSE)","v":400},{"$f":"VLOOKUP(B276,'2022emp'!$A$2:$H$633,8,FALSE)","v":75},-10,1.153846153846154,"Not Manufacturing Dependent",1.2]
["North East","Hartlepool",3500,28000,12.5,170,175,185,-15,-5,"Jill","Mortimer","Conservative","Change","Mike","Hill","Labour",3500,150,"New MP","Jill Mortimer",null,"Manufacturing Dependent",12.068965517241379,12.1,12.1,135,{"$f":"VLOOKUP(B277,'2022emp'!$A$2:$B$633,2,FALSE)","v":3500},{"$f":"VLOOKUP(B277,'2022emp'!$A$2:$F$633,4,FALSE)","v":30000},{"$f":"VLOOKUP(B277,'2022emp'!$A$2:$H$633,7,FALSE)","v":3500},{"$f":"VLOOKUP(B277,'2022emp'!$A$2:$H$633,8,FALSE)","v":250},-40,11.666666666666666,"Manufacturing Dependent",11.7]
["Eastern","Harwich and North Essex",1750,31000,5.6451612903225801,260,265,260,0,-5,"Bernard","Jenkin","Conservative","Hold","Bernard","Jenkin","Conservative",1500,225,"Same MP","Bernard Jenkin",null,"Not Manufacturing Dependent",6.8181818181818175,6.8,6.8,255,{"$f":"VLOOKUP(B278,'2022emp'!$A$2:$B$633,2,FALSE)","v":2000},{"$f":"VLOOKUP(B278,'2022emp'!$A$2:$F$633,4,FALSE)","v":41000},{"$f":"VLOOKUP(B278,'2022emp'!$A$2:$H$633,7,FALSE)","v":1500},{"$f":"VLOOKUP(B278,'2022emp'!$A$2:$H$633,8,FALSE)","v":350},-10,4.8780487804878048,"Not Manufacturing Dependent",4.9000000000000004]
["South East","Hastings and Rye",3000,36000,8.3333333333333321,235,235,225,10,0,"Sally-Ann","Hart","Conservative","Hold","Sally-Ann","Hart","Conservative",2500,400,"Same MP","Sally-Ann Hart",null,"Manufacturing Dependent",8.3333333333333321,8.3000000000000007,8.3000000000000007,245,{"$f":"VLOOKUP(B279,'2022emp'!$A$2:$B$633,2,FALSE)","v":3000},{"$f":"VLOOKUP(B279,'2022emp'!$A$2:$F$633,4,FALSE)","v":37000},{"$f":"VLOOKUP(B279,'2022emp'!$A$2:$H$633,7,FALSE)","v":2500},{"$f":"VLOOKUP(B279,'2022emp'!$A$2:$H$633,8,FALSE)","v":350},10,8.1081081081081088,"Not Manufacturing Dependent",8.1]
["South East","Havant",3000,31000,9.67741935483871,195,180,190,5,15,"Alan","Mak","Conservative","Hold","Alan","Mak","Conservative",2500,300,"Same MP","Alan Mak",null,"Manufacturing Dependent",10.606060606060606,10.6,10.6,190,{"$f":"VLOOKUP(B280,'2022emp'!$A$2:$B$633,2,FALSE)","v":2500},{"$f":"VLOOKUP(B280,'2022emp'!$A$2:$F$633,4,FALSE)","v":31000},{"$f":"VLOOKUP(B280,'2022emp'!$A$2:$H$633,7,FALSE)","v":2250},{"$f":"VLOOKUP(B280,'2022emp'!$A$2:$H$633,8,FALSE)","v":250},10,8.064516129032258,"Not Manufacturing Dependent",8.1]
["London","Hayes and Harlington",3500,89000,3.9325842696629212,190,180,185,5,10,"John Martin","McDonnell","Labour","Hold","John Martin","McDonnell","Labour",3000,400,"Same MP","John Martin McDonnell",null,"Not Manufacturing Dependent",3.804347826086957,3.8,3.8,195,{"$f":"VLOOKUP(B281,'2022emp'!$A$2:$B$633,2,FALSE)","v":3000},{"$f":"VLOOKUP(B281,'2022emp'!$A$2:$F$633,4,FALSE)","v":94000},{"$f":"VLOOKUP(B281,'2022emp'!$A$2:$H$633,7,FALSE)","v":2500},{"$f":"VLOOKUP(B281,'2022emp'!$A$2:$H$633,8,FALSE)","v":250},15,3.1914893617021276,"Not Manufacturing Dependent",3.2]
["North West","Hazel Grove",2500,21000,11.904761904761903,190,190,210,-20,0,"William","Wragg","Conservative","Hold","William","Wragg","Conservative",2500,225,"Same MP","William Wragg",null,"Manufacturing Dependent",11.904761904761903,11.9,11.9,185,{"$f":"VLOOKUP(B282,'2022emp'!$A$2:$B$633,2,FALSE)","v":2250},{"$f":"VLOOKUP(B282,'2022emp'!$A$2:$F$633,4,FALSE)","v":21000},{"$f":"VLOOKUP(B282,'2022emp'!$A$2:$H$633,7,FALSE)","v":2250},{"$f":"VLOOKUP(B282,'2022emp'!$A$2:$H$633,8,FALSE)","v":175},-5,10.714285714285714,"Manufacturing Dependent",10.7]
["Eastern","Hemel Hempstead",2500,79000,3.1645569620253164,215,205,210,5,10,"Mike","Penning","Conservative","Hold","Mike","Penning","Conservative",2500,250,"Same MP","Mike Penning",null,"Not Manufacturing Dependent",4.716981132075472,4.7,4.7,200,{"$f":"VLOOKUP(B283,'2022emp'!$A$2:$B$633,2,FALSE)","v":2500},{"$f":"VLOOKUP(B283,'2022emp'!$A$2:$F$633,4,FALSE)","v":99000},{"$f":"VLOOKUP(B283,'2022emp'!$A$2:$H$633,7,FALSE)","v":2500},{"$f":"VLOOKUP(B283,'2022emp'!$A$2:$H$633,8,FALSE)","v":350},-5,2.5252525252525251,"Not Manufacturing Dependent",2.5]
["Yorkshire & the Humber","Hemsworth",2500,26000,9.6153846153846168,155,145,145,10,10,"Jon","Trickett","Labour","Hold","Jon","Trickett","Labour",2500,200,"Same MP","Jon Trickett",null,"Manufacturing Dependent",9.6153846153846168,9.6,9.6,145,{"$f":"VLOOKUP(B284,'2022emp'!$A$2:$B$633,2,FALSE)","v":3000},{"$f":"VLOOKUP(B284,'2022emp'!$A$2:$F$633,4,FALSE)","v":28000},{"$f":"VLOOKUP(B284,'2022emp'!$A$2:$H$633,7,FALSE)","v":2500},{"$f":"VLOOKUP(B284,'2022emp'!$A$2:$H$633,8,FALSE)","v":225},0,10.714285714285714,"Manufacturing Dependent",10.7]
["London","Hendon",2000,47000,4.2553191489361701,195,170,165,30,25,"Matthew","Offord","Conservative","Hold","Matthew","Offord","Conservative",1500,350,"Same MP","Matthew Offord",null,"Not Manufacturing Dependent",3.6458333333333335,3.6,3.6,205,{"$f":"VLOOKUP(B285,'2022emp'!$A$2:$B$633,2,FALSE)","v":2000},{"$f":"VLOOKUP(B285,'2022emp'!$A$2:$F$633,4,FALSE)","v":54000},{"$f":"VLOOKUP(B285,'2022emp'!$A$2:$H$633,7,FALSE)","v":1750},{"$f":"VLOOKUP(B285,'2022emp'!$A$2:$H$633,8,FALSE)","v":225},35,3.7037037037037033,"Not Manufacturing Dependent",3.7]
["South East","Henley",3000,45000,6.666666666666667,320,300,320,0,20,"John","Howell","Conservative","Hold","John","Howell","Conservative",2500,400,"Same MP","John Howell",null,"Not Manufacturing Dependent",6.8181818181818175,6.8,6.8,335,{"$f":"VLOOKUP(B286,'2022emp'!$A$2:$B$633,2,FALSE)","v":3000},{"$f":"VLOOKUP(B286,'2022emp'!$A$2:$F$633,4,FALSE)","v":48000},{"$f":"VLOOKUP(B286,'2022emp'!$A$2:$H$633,7,FALSE)","v":2250},{"$f":"VLOOKUP(B286,'2022emp'!$A$2:$H$633,8,FALSE)","v":450},35,6.25,"Not Manufacturing Dependent",6.3]
["West Midlands","Hereford and South Herefordshire",7000,46000,15.217391304347828,285,285,280,5,0,"Jesse","Norman","Conservative","Hold","Jesse","Norman","Conservative",6000,500,"Same MP","Jesse Norman",null,"Manufacturing Dependent",14.583333333333334,14.6,14.6,290,{"$f":"VLOOKUP(B287,'2022emp'!$A$2:$B$633,2,FALSE)","v":7000},{"$f":"VLOOKUP(B287,'2022emp'!$A$2:$F$633,4,FALSE)","v":48000},{"$f":"VLOOKUP(B287,'2022emp'!$A$2:$H$633,7,FALSE)","v":6000},{"$f":"VLOOKUP(B287,'2022emp'!$A$2:$H$633,8,FALSE)","v":700},5,14.583333333333334,"Manufacturing Dependent",14.6]
["Eastern","Hertford and Stortford",3500,60000,5.833333333333333,290,315,350,-60,-25,"Julie","Marson","Conservative","Hold","Julie","Marson","Conservative",3000,250,"Same MP","Julie Marson",null,"Not Manufacturing Dependent",5.5555555555555554,5.6,5.6,280,{"$f":"VLOOKUP(B288,'2022emp'!$A$2:$B$633,2,FALSE)","v":3500},{"$f":"VLOOKUP(B288,'2022emp'!$A$2:$F$633,4,FALSE)","v":55000},{"$f":"VLOOKUP(B288,'2022emp'!$A$2:$H$633,7,FALSE)","v":3000},{"$f":"VLOOKUP(B288,'2022emp'!$A$2:$H$633,8,FALSE)","v":300},-35,6.3636363636363633,"Not Manufacturing Dependent",6.4]
["Eastern","Hertsmere",2500,58000,4.3103448275862073,255,245,250,5,10,"Oliver","Dowden","Conservative","Hold","Oliver","Dowden","Conservative",2250,150,"Same MP","Oliver Dowden",null,"Not Manufacturing Dependent",2.8301886792452833,2.8,2.8,250,{"$f":"VLOOKUP(B289,'2022emp'!$A$2:$B$633,2,FALSE)","v":2500},{"$f":"VLOOKUP(B289,'2022emp'!$A$2:$F$633,4,FALSE)","v":58000},{"$f":"VLOOKUP(B289,'2022emp'!$A$2:$H$633,7,FALSE)","v":2500},{"$f":"VLOOKUP(B289,'2022emp'!$A$2:$H$633,8,FALSE)","v":200},5,4.3103448275862073,"Not Manufacturing Dependent",4.3]
["North East","Hexham",2250,24000,9.375,160,150,155,5,10,"Guy","Opperman","Conservative","Hold","Guy","Opperman","Conservative",2000,100,"Same MP","Guy Opperman",null,"Manufacturing Dependent",9,9,9,160,{"$f":"VLOOKUP(B290,'2022emp'!$A$2:$B$633,2,FALSE)","v":2500},{"$f":"VLOOKUP(B290,'2022emp'!$A$2:$F$633,4,FALSE)","v":26000},{"$f":"VLOOKUP(B290,'2022emp'!$A$2:$H$633,7,FALSE)","v":2250},{"$f":"VLOOKUP(B290,'2022emp'!$A$2:$H$633,8,FALSE)","v":200},10,9.6153846153846168,"Manufacturing Dependent",9.6]
["North West","Heywood and Middleton",4500,32000,14.0625,235,215,220,15,20,"Chris","Clarkson","Conservative","Hold","Chris","Clarkson","Conservative",4000,450,"Same MP","Chris Clarkson",null,"Manufacturing Dependent",13.888888888888889,13.9,13.9,220,{"$f":"VLOOKUP(B291,'2022emp'!$A$2:$B$633,2,FALSE)","v":4500},{"$f":"VLOOKUP(B291,'2022emp'!$A$2:$F$633,4,FALSE)","v":36000},{"$f":"VLOOKUP(B291,'2022emp'!$A$2:$H$633,7,FALSE)","v":4000},{"$f":"VLOOKUP(B291,'2022emp'!$A$2:$H$633,8,FALSE)","v":500},5,12.5,"Manufacturing Dependent",12.5]
["East Midlands","High Peak",5000,30000,16.666666666666664,280,285,290,-10,-5,"Robert","Largan","Conservative","Hold","Robert","Largan","Conservative",5000,500,"Same MP","Robert Largan",null,"Very Manufacturing Dependent",18.75,18.8,18.8,285,{"$f":"VLOOKUP(B292,'2022emp'!$A$2:$B$633,2,FALSE)","v":6000},{"$f":"VLOOKUP(B292,'2022emp'!$A$2:$F$633,4,FALSE)","v":33000},{"$f":"VLOOKUP(B292,'2022emp'!$A$2:$H$633,7,FALSE)","v":5000},{"$f":"VLOOKUP(B292,'2022emp'!$A$2:$H$633,8,FALSE)","v":450},0,18.181818181818183,"Very Manufacturing Dependent",18.2]
["Eastern","Hitchin and Harpenden",1500,47000,3.1914893617021276,195,200,200,-5,-5,"Bim","Afolami","Conservative","Hold","Bim","Afolami","Conservative",1500,175,"Same MP","Bim Afolami",null,"Not Manufacturing Dependent",3.7234042553191489,3.7,3.7,185,{"$f":"VLOOKUP(B293,'2022emp'!$A$2:$B$633,2,FALSE)","v":1750},{"$f":"VLOOKUP(B293,'2022emp'!$A$2:$F$633,4,FALSE)","v":37000},{"$f":"VLOOKUP(B293,'2022emp'!$A$2:$H$633,7,FALSE)","v":1500},{"$f":"VLOOKUP(B293,'2022emp'!$A$2:$H$633,8,FALSE)","v":225},-15,4.7297297297297298,"Not Manufacturing Dependent",4.7]
["London","Holborn and St Pancras",3000,320000,0.9375,815,735,920,-105,80,"Keir","Starmer","Labour","Hold","Keir","Starmer","Labour",2250,600,"Same MP","Keir Starmer",null,"Not Manufacturing Dependent",1.0736196319018405,1.1000000000000001,1.1000000000000001,795,{"$f":"VLOOKUP(B294,'2022emp'!$A$2:$B$633,2,FALSE)","v":3500},{"$f":"VLOOKUP(B294,'2022emp'!$A$2:$F$633,4,FALSE)","v":360000},{"$f":"VLOOKUP(B294,'2022emp'!$A$2:$H$633,7,FALSE)","v":3000},{"$f":"VLOOKUP(B294,'2022emp'!$A$2:$H$633,8,FALSE)","v":500},60,0.97222222222222221,"Not Manufacturing Dependent",1]
["London","Hornchurch and Upminster",1000,30000,3.3333333333333335,145,150,155,-10,-5,"Julia","Lopez","Conservative","Hold","Julia","Lopez","Conservative",900,150,"Same MP","Julia Lopez",null,"Not Manufacturing Dependent",3.5714285714285712,3.6,3.6,150,{"$f":"VLOOKUP(B295,'2022emp'!$A$2:$B$633,2,FALSE)","v":800},{"$f":"VLOOKUP(B295,'2022emp'!$A$2:$F$633,4,FALSE)","v":30000},{"$f":"VLOOKUP(B295,'2022emp'!$A$2:$H$633,7,FALSE)","v":700},{"$f":"VLOOKUP(B295,'2022emp'!$A$2:$H$633,8,FALSE)","v":125},0,2.666666666666667,"Not Manufacturing Dependent",2.7]
["London","Hornsey and Wood Green",1000,33000,3.0303030303030303,190,175,180,10,15,"Catherine","West","Labour","Hold","Catherine","West","Labour",800,175,"Same MP","Catherine West",null,"Not Manufacturing Dependent",2.6470588235294117,2.6,2.6,185,{"$f":"VLOOKUP(B296,'2022emp'!$A$2:$B$633,2,FALSE)","v":900},{"$f":"VLOOKUP(B296,'2022emp'!$A$2:$F$633,4,FALSE)","v":36000},{"$f":"VLOOKUP(B296,'2022emp'!$A$2:$H$633,7,FALSE)","v":800},{"$f":"VLOOKUP(B296,'2022emp'!$A$2:$H$633,8,FALSE)","v":100},10,2.5,"Not Manufacturing Dependent",2.5]
["South East","Horsham",2250,46000,4.8913043478260869,275,275,285,-10,0,"Jeremy","Quin","Conservative","Hold","Jeremy","Quin","Conservative",2000,300,"Same MP","Jeremy Quin",null,"Not Manufacturing Dependent",5,5,5,270,{"$f":"VLOOKUP(B297,'2022emp'!$A$2:$B$633,2,FALSE)","v":2250},{"$f":"VLOOKUP(B297,'2022emp'!$A$2:$F$633,4,FALSE)","v":47000},{"$f":"VLOOKUP(B297,'2022emp'!$A$2:$H$633,7,FALSE)","v":2000},{"$f":"VLOOKUP(B297,'2022emp'!$A$2:$H$633,8,FALSE)","v":300},-5,4.7872340425531918,"Not Manufacturing Dependent",4.8]
["North East","Houghton and Sunderland South",1500,25000,6,100,85,85,15,15,"Bridget","Phillipson","Labour","Hold","Bridget","Phillipson","Labour",1500,50,"Same MP","Bridget Phillipson",null,"Not Manufacturing Dependent",7.291666666666667,7.3,7.3,80,{"$f":"VLOOKUP(B298,'2022emp'!$A$2:$B$633,2,FALSE)","v":1500},{"$f":"VLOOKUP(B298,'2022emp'!$A$2:$F$633,4,FALSE)","v":21000},{"$f":"VLOOKUP(B298,'2022emp'!$A$2:$H$633,7,FALSE)","v":1250},{"$f":"VLOOKUP(B298,'2022emp'!$A$2:$H$633,8,FALSE)","v":100},-5,7.1428571428571423,"Not Manufacturing Dependent",7.1]
["South East","Hove",1000,38000,2.6315789473684208,175,170,175,0,5,"Peter","Kyle","Labour","Hold","Peter","Kyle","Labour",1000,150,"Same MP","Peter Kyle",null,"Not Manufacturing Dependent",2.6315789473684208,2.6,2.6,180,{"$f":"VLOOKUP(B299,'2022emp'!$A$2:$B$633,2,FALSE)","v":1000},{"$f":"VLOOKUP(B299,'2022emp'!$A$2:$F$633,4,FALSE)","v":39000},{"$f":"VLOOKUP(B299,'2022emp'!$A$2:$H$633,7,FALSE)","v":800},{"$f":"VLOOKUP(B299,'2022emp'!$A$2:$H$633,8,FALSE)","v":175},10,2.5641025641025639,"Not Manufacturing Dependent",2.6]
["Yorkshire & the Humber","Huddersfield",5000,50000,10,215,195,205,10,20,"Barry","Sheerman","Labour/Co-operative","Hold","Barry","Sheerman","Labour/Co-operative",4500,450,"Same MP","Barry Sheerman",null,"Manufacturing Dependent",12,12,12,215,{"$f":"VLOOKUP(B300,'2022emp'!$A$2:$B$633,2,FALSE)","v":6000},{"$f":"VLOOKUP(B300,'2022emp'!$A$2:$F$633,4,FALSE)","v":50000},{"$f":"VLOOKUP(B300,'2022emp'!$A$2:$H$633,7,FALSE)","v":5000},{"$f":"VLOOKUP(B300,'2022emp'!$A$2:$H$633,8,FALSE)","v":500},20,12,"Manufacturing Dependent",12]
["Eastern","Huntingdon",8000,58000,13.793103448275861,390,350,390,0,40,"Jonathan","Djanogly","Conservative","Hold","Jonathan","Djanogly","Conservative",8000,600,"Same MP","Jonathan Djanogly",null,"Manufacturing Dependent",15.517241379310345,15.5,15.5,320,{"$f":"VLOOKUP(B301,'2022emp'!$A$2:$B$633,2,FALSE)","v":9000},{"$f":"VLOOKUP(B301,'2022emp'!$A$2:$F$633,4,FALSE)","v":59000},{"$f":"VLOOKUP(B301,'2022emp'!$A$2:$H$633,7,FALSE)","v":8000},{"$f":"VLOOKUP(B301,'2022emp'!$A$2:$H$633,8,FALSE)","v":800},-30,15.254237288135593,"Manufacturing Dependent",15.3]
["North West","Hyndburn",7000,32000,21.875,285,310,295,-10,-25,"Sara","Britcliffe","Conservative","Hold","Sara","Britcliffe","Conservative",7000,500,"Same MP","Sara Britcliffe",null,"Very Manufacturing Dependent",24.242424242424242,24.2,24.2,290,{"$f":"VLOOKUP(B302,'2022emp'!$A$2:$B$633,2,FALSE)","v":8000},{"$f":"VLOOKUP(B302,'2022emp'!$A$2:$F$633,4,FALSE)","v":34000},{"$f":"VLOOKUP(B302,'2022emp'!$A$2:$H$633,7,FALSE)","v":7000},{"$f":"VLOOKUP(B302,'2022emp'!$A$2:$H$633,8,FALSE)","v":450},-20,23.52941176470588,"Very Manufacturing Dependent",23.5]
["London","Ilford North",1000,25000,4,180,150,150,30,30,"Wes","Streeting","Labour","Hold","Wes","Streeting","Labour",900,225,"Same MP","Wes Streeting",null,"Not Manufacturing Dependent",3.2,3.2,3.2,165,{"$f":"VLOOKUP(B303,'2022emp'!$A$2:$B$633,2,FALSE)","v":800},{"$f":"VLOOKUP(B303,'2022emp'!$A$2:$F$633,4,FALSE)","v":27000},{"$f":"VLOOKUP(B303,'2022emp'!$A$2:$H$633,7,FALSE)","v":700},{"$f":"VLOOKUP(B303,'2022emp'!$A$2:$H$633,8,FALSE)","v":125},15,2.9629629629629632,"Not Manufacturing Dependent",3]
["London","Ilford South",600,40000,1.5,140,135,140,0,5,"Sam","Tarry","Labour","Hold","Sam","Tarry","Labour",500,100,"Same MP","Sam Tarry",null,"Not Manufacturing Dependent",1.4634146341463417,1.5,1.5,165,{"$f":"VLOOKUP(B304,'2022emp'!$A$2:$B$633,2,FALSE)","v":600},{"$f":"VLOOKUP(B304,'2022emp'!$A$2:$F$633,4,FALSE)","v":43000},{"$f":"VLOOKUP(B304,'2022emp'!$A$2:$H$633,7,FALSE)","v":500},{"$f":"VLOOKUP(B304,'2022emp'!$A$2:$H$633,8,FALSE)","v":75},30,1.3953488372093024,"Not Manufacturing Dependent",1.4]
["Scotland","Inverclyde",2250,26000,8.6538461538461533,90,100,95,-5,-10,"Ronnie","Cowan","Scottish National Party","Hold","Ronnie","Cowan","Scottish National Party",2000,250,"Same MP","Ronnie Cowan",null,"Manufacturing Dependent",6.481481481481481,6.5,6.5,85,{"$f":"VLOOKUP(B305,'2022emp'!$A$2:$B$633,2,FALSE)","v":1750},{"$f":"VLOOKUP(B305,'2022emp'!$A$2:$F$633,4,FALSE)","v":25000},{"$f":"VLOOKUP(B305,'2022emp'!$A$2:$H$633,7,FALSE)","v":1500},{"$f":"VLOOKUP(B305,'2022emp'!$A$2:$H$633,8,FALSE)","v":175},-15,7.0000000000000009,"Not Manufacturing Dependent",7]
["Scotland","Inverness, Nairn, Badenoch and Strathspey",2000,57000,3.5087719298245612,195,180,185,10,15,"Drew","Hendry","Scottish National Party","Hold","Drew","Hendry","Scottish National Party",1750,200,"Same MP","Drew Hendry",null,"Not Manufacturing Dependent",4.1666666666666661,4.2,4.2,200,{"$f":"VLOOKUP(B306,'2022emp'!$A$2:$B$633,2,FALSE)","v":2250},{"$f":"VLOOKUP(B306,'2022emp'!$A$2:$F$633,4,FALSE)","v":60000},{"$f":"VLOOKUP(B306,'2022emp'!$A$2:$H$633,7,FALSE)","v":2000},{"$f":"VLOOKUP(B306,'2022emp'!$A$2:$H$633,8,FALSE)","v":300},20,3.75,"Not Manufacturing Dependent",3.8]
["Eastern","Ipswich",1500,62000,2.4193548387096775,120,135,125,-5,-15,"Tom","Hunt","Conservative","Hold","Tom","Hunt","Conservative",1500,150,"Same MP","Tom Hunt",null,"Not Manufacturing Dependent",2.82258064516129,2.8,2.8,155,{"$f":"VLOOKUP(B307,'2022emp'!$A$2:$B$633,2,FALSE)","v":1500},{"$f":"VLOOKUP(B307,'2022emp'!$A$2:$F$633,4,FALSE)","v":62000},{"$f":"VLOOKUP(B307,'2022emp'!$A$2:$H$633,7,FALSE)","v":1250},{"$f":"VLOOKUP(B307,'2022emp'!$A$2:$H$633,8,FALSE)","v":200},20,2.4193548387096775,"Not Manufacturing Dependent",2.4]
["South East","Isle of Wight",4000,48000,8.3333333333333321,340,300,325,15,40,"Bob","Seely","Conservative","Hold","Bob","Seely","Conservative",3500,600,"Same MP","Bob Seely",null,"Manufacturing Dependent",10,10,10,315,{"$f":"VLOOKUP(B308,'2022emp'!$A$2:$B$633,2,FALSE)","v":4000},{"$f":"VLOOKUP(B308,'2022emp'!$A$2:$F$633,4,FALSE)","v":50000},{"$f":"VLOOKUP(B308,'2022emp'!$A$2:$H$633,7,FALSE)","v":3500},{"$f":"VLOOKUP(B308,'2022emp'!$A$2:$H$633,8,FALSE)","v":350},15,8,"Not Manufacturing Dependent",8]
["London","Islington North",300,31000,0.967741935483871,125,135,135,-10,-10,"Jeremy","Corbyn","Independent","Change","Jeremy","Corbyn","Labour",250,75,"Same MP","Jeremy Corbyn",null,"Not Manufacturing Dependent",1.3636363636363635,1.4,1.4,130,{"$f":"VLOOKUP(B309,'2022emp'!$A$2:$B$633,2,FALSE)","v":450},{"$f":"VLOOKUP(B309,'2022emp'!$A$2:$F$633,4,FALSE)","v":34000},{"$f":"VLOOKUP(B309,'2022emp'!$A$2:$H$633,7,FALSE)","v":400},{"$f":"VLOOKUP(B309,'2022emp'!$A$2:$H$633,8,FALSE)","v":75},-5,1.3235294117647058,"Not Manufacturing Dependent",1.3]
["London","Islington South and Finsbury",2500,191000,1.3089005235602094,485,375,410,75,110,"Emily","Thornberry","Labour","Hold","Emily","Thornberry","Labour",2000,350,"Same MP","Emily Thornberry",null,"Not Manufacturing Dependent",1.2626262626262625,1.3,1.3,440,{"$f":"VLOOKUP(B310,'2022emp'!$A$2:$B$633,2,FALSE)","v":2500},{"$f":"VLOOKUP(B310,'2022emp'!$A$2:$F$633,4,FALSE)","v":226000},{"$f":"VLOOKUP(B310,'2022emp'!$A$2:$H$633,7,FALSE)","v":2250},{"$f":"VLOOKUP(B310,'2022emp'!$A$2:$H$633,8,FALSE)","v":250},65,1.1061946902654867,"Not Manufacturing Dependent",1.1000000000000001]
["Wales","Islwyn",7000,20000,35,165,165,170,-5,0,"Chris","Evans","Labour/Co-operative","Hold","Chris","Evans","Labour/Co-operative",6000,600,"Same MP","Chris Evans",null,"Extremely Manufacturing Dependent",33.333333333333329,33.299999999999997,33.299999999999997,165,{"$f":"VLOOKUP(B311,'2022emp'!$A$2:$B$633,2,FALSE)","v":6000},{"$f":"VLOOKUP(B311,'2022emp'!$A$2:$F$633,4,FALSE)","v":21000},{"$f":"VLOOKUP(B311,'2022emp'!$A$2:$H$633,7,FALSE)","v":6000},{"$f":"VLOOKUP(B311,'2022emp'!$A$2:$H$633,8,FALSE)","v":250},0,28.571428571428569,"Extremely Manufacturing Dependent",28.6]
["North East","Jarrow",4000,26000,15.384615384615385,155,170,165,-10,-15,"Kate","Osborne","Labour","Hold","Kate","Osborne","Labour",4000,175,"Same MP","Kate Osborne",null,"Manufacturing Dependent",18,18,18,135,{"$f":"VLOOKUP(B312,'2022emp'!$A$2:$B$633,2,FALSE)","v":4000},{"$f":"VLOOKUP(B312,'2022emp'!$A$2:$F$633,4,FALSE)","v":27000},{"$f":"VLOOKUP(B312,'2022emp'!$A$2:$H$633,7,FALSE)","v":3500},{"$f":"VLOOKUP(B312,'2022emp'!$A$2:$H$633,8,FALSE)","v":300},-35,14.814814814814813,"Manufacturing Dependent",14.8]
["Yorkshire & the Humber","Keighley",4500,34000,13.23529411764706,305,285,295,10,20,"Robbie","Moore","Conservative","Hold","Robbie","Moore","Conservative",4000,450,"Same MP","Robbie Moore",null,"Manufacturing Dependent",14.705882352941178,14.7,14.7,290,{"$f":"VLOOKUP(B313,'2022emp'!$A$2:$B$633,2,FALSE)","v":5000},{"$f":"VLOOKUP(B313,'2022emp'!$A$2:$F$633,4,FALSE)","v":37000},{"$f":"VLOOKUP(B313,'2022emp'!$A$2:$H$633,7,FALSE)","v":4500},{"$f":"VLOOKUP(B313,'2022emp'!$A$2:$H$633,8,FALSE)","v":600},5,13.513513513513514,"Manufacturing Dependent",13.5]
["West Midlands","Kenilworth and Southam",13000,47000,27.659574468085108,265,260,265,0,5,"Jeremy","Wright","Conservative","Hold","Jeremy","Wright","Conservative",13000,250,"Same MP","Jeremy Wright",null,"Extremely Manufacturing Dependent",26.086956521739129,26.1,26.1,255,{"$f":"VLOOKUP(B314,'2022emp'!$A$2:$B$633,2,FALSE)","v":14000},{"$f":"VLOOKUP(B314,'2022emp'!$A$2:$F$633,4,FALSE)","v":50000},{"$f":"VLOOKUP(B314,'2022emp'!$A$2:$H$633,7,FALSE)","v":13000},{"$f":"VLOOKUP(B314,'2022emp'!$A$2:$H$633,8,FALSE)","v":800},-5,28.000000000000004,"Extremely Manufacturing Dependent",28]
["London","Kensington",1250,95000,1.3157894736842104,220,230,225,-5,-10,"Felicity","Buchan","Conservative","Hold","Felicity","Buchan","Conservative",900,400,"Same MP","Felicity Buchan",null,"Not Manufacturing Dependent",0.99009900990099009,1,1,205,{"$f":"VLOOKUP(B315,'2022emp'!$A$2:$B$633,2,FALSE)","v":1000},{"$f":"VLOOKUP(B315,'2022emp'!$A$2:$F$633,4,FALSE)","v":99000},{"$f":"VLOOKUP(B315,'2022emp'!$A$2:$H$633,7,FALSE)","v":800},{"$f":"VLOOKUP(B315,'2022emp'!$A$2:$H$633,8,FALSE)","v":200},-25,1.0101010101010102,"Not Manufacturing Dependent",1]
["East Midlands","Kettering",4500,48000,9.375,255,265,255,0,-10,"Philip","Hollobone","Conservative","Hold","Philip","Hollobone","Conservative",4000,500,"Same MP","Philip Hollobone",null,"Manufacturing Dependent",10.869565217391305,10.9,10.9,230,{"$f":"VLOOKUP(B316,'2022emp'!$A$2:$B$633,2,FALSE)","v":4000},{"$f":"VLOOKUP(B316,'2022emp'!$A$2:$F$633,4,FALSE)","v":46000},{"$f":"VLOOKUP(B316,'2022emp'!$A$2:$H$633,7,FALSE)","v":4000},{"$f":"VLOOKUP(B316,'2022emp'!$A$2:$H$633,8,FALSE)","v":300},-35,8.695652173913043,"Not Manufacturing Dependent",8.6999999999999993]
["Scotland","Kilmarnock and Loudoun",2250,34000,6.6176470588235299,160,155,165,-5,5,"Alan","Brown","Scottish National Party","Hold","Alan","Brown","Scottish National Party",2000,225,"Same MP","Alan Brown",null,"Not Manufacturing Dependent",7.3529411764705888,7.4,7.4,145,{"$f":"VLOOKUP(B317,'2022emp'!$A$2:$B$633,2,FALSE)","v":2250},{"$f":"VLOOKUP(B317,'2022emp'!$A$2:$F$633,4,FALSE)","v":35000},{"$f":"VLOOKUP(B317,'2022emp'!$A$2:$H$633,7,FALSE)","v":2000},{"$f":"VLOOKUP(B317,'2022emp'!$A$2:$H$633,8,FALSE)","v":350},-10,6.4285714285714279,"Not Manufacturing Dependent",6.4]
["London","Kingston and Surbiton",2000,57000,3.5087719298245612,205,195,195,10,10,"Edward","Davey","Liberal Democrat","Hold","Edward","Davey","Liberal Democrat",1500,350,"Same MP","Edward Davey",null,"Not Manufacturing Dependent",2.734375,2.7,2.7,250,{"$f":"VLOOKUP(B318,'2022emp'!$A$2:$B$633,2,FALSE)","v":2000},{"$f":"VLOOKUP(B318,'2022emp'!$A$2:$F$633,4,FALSE)","v":59000},{"$f":"VLOOKUP(B318,'2022emp'!$A$2:$H$633,7,FALSE)","v":1750},{"$f":"VLOOKUP(B318,'2022emp'!$A$2:$H$633,8,FALSE)","v":300},55,3.3898305084745761,"Not Manufacturing Dependent",3.4]
["Yorkshire & the Humber","Kingston upon Hull East",13000,38000,34.210526315789473,270,270,265,5,0,"Karl","Turner","Labour","Hold","Karl","Turner","Labour",12000,800,"Same MP","Karl Turner",null,"Extremely Manufacturing Dependent",31.707317073170731,31.7,31.7,265,{"$f":"VLOOKUP(B319,'2022emp'!$A$2:$B$633,2,FALSE)","v":15000},{"$f":"VLOOKUP(B319,'2022emp'!$A$2:$F$633,4,FALSE)","v":42000},{"$f":"VLOOKUP(B319,'2022emp'!$A$2:$H$633,7,FALSE)","v":14000},{"$f":"VLOOKUP(B319,'2022emp'!$A$2:$H$633,8,FALSE)","v":1500},-5,35.714285714285715,"Extremely Manufacturing Dependent",35.700000000000003]
["Yorkshire & the Humber","Kingston upon Hull North",1250,21000,5.9523809523809517,115,90,95,20,25,"Diana R.","Johnson","Labour","Hold","Diana R.","Johnson","Labour",1000,200,"Same MP","Diana R. Johnson",null,"Not Manufacturing Dependent",6.5217391304347823,6.5,6.5,130,{"$f":"VLOOKUP(B320,'2022emp'!$A$2:$B$633,2,FALSE)","v":1750},{"$f":"VLOOKUP(B320,'2022emp'!$A$2:$F$633,4,FALSE)","v":23000},{"$f":"VLOOKUP(B320,'2022emp'!$A$2:$H$633,7,FALSE)","v":1500},{"$f":"VLOOKUP(B320,'2022emp'!$A$2:$H$633,8,FALSE)","v":225},40,7.608695652173914,"Not Manufacturing Dependent",7.6]
["Yorkshire & the Humber","Kingston upon Hull West and Hessle",6000,70000,8.5714285714285712,270,255,260,10,15,"Emma","Hardy","Labour","Hold","Emma","Hardy","Labour",6000,800,"Same MP","Emma Hardy",null,"Manufacturing Dependent",9.8591549295774641,9.9,9.9,270,{"$f":"VLOOKUP(B321,'2022emp'!$A$2:$B$633,2,FALSE)","v":6000},{"$f":"VLOOKUP(B321,'2022emp'!$A$2:$F$633,4,FALSE)","v":71000},{"$f":"VLOOKUP(B321,'2022emp'!$A$2:$H$633,7,FALSE)","v":5000},{"$f":"VLOOKUP(B321,'2022emp'!$A$2:$H$633,8,FALSE)","v":800},15,8.4507042253521121,"Not Manufacturing Dependent",8.5]
["South West","Kingswood",1000,24000,4.1666666666666661,170,170,165,5,0,"Damien","Egan","Labour","Change","Chris","Skidmore","Conservative",1000,100,"New MP","Damien Egan",null,"Not Manufacturing Dependent",5,5,5,175,{"$f":"VLOOKUP(B322,'2022emp'!$A$2:$B$633,2,FALSE)","v":1500},{"$f":"VLOOKUP(B322,'2022emp'!$A$2:$F$633,4,FALSE)","v":26000},{"$f":"VLOOKUP(B322,'2022emp'!$A$2:$H$633,7,FALSE)","v":1250},{"$f":"VLOOKUP(B322,'2022emp'!$A$2:$H$633,8,FALSE)","v":150},5,5.7692307692307692,"Not Manufacturing Dependent",5.8]
["Scotland","Kirkcaldy and Cowdenbeath",3000,30000,10,240,335,285,-45,-95,"Neale","Hanvey","Alba","Change","Neale","Hanvey","Independent",2500,400,"Same MP","Neale Hanvey",null,"Manufacturing Dependent",10.9375,10.9,10.9,145,{"$f":"VLOOKUP(B323,'2022emp'!$A$2:$B$633,2,FALSE)","v":2500},{"$f":"VLOOKUP(B323,'2022emp'!$A$2:$F$633,4,FALSE)","v":32000},{"$f":"VLOOKUP(B323,'2022emp'!$A$2:$H$633,7,FALSE)","v":2250},{"$f":"VLOOKUP(B323,'2022emp'!$A$2:$H$633,8,FALSE)","v":225},-190,7.8125,"Not Manufacturing Dependent",7.8]
["North West","Knowsley",5000,44000,11.363636363636363,255,225,235,20,30,"George","Howarth","Labour","Hold","George","Howarth","Labour",5000,600,"Same MP","George Howarth",null,"Manufacturing Dependent",15,15,15,240,{"$f":"VLOOKUP(B324,'2022emp'!$A$2:$B$633,2,FALSE)","v":5000},{"$f":"VLOOKUP(B324,'2022emp'!$A$2:$F$633,4,FALSE)","v":46000},{"$f":"VLOOKUP(B324,'2022emp'!$A$2:$H$633,7,FALSE)","v":4500},{"$f":"VLOOKUP(B324,'2022emp'!$A$2:$H$633,8,FALSE)","v":500},15,10.869565217391305,"Manufacturing Dependent",10.9]
["Northern Ireland","Lagan Valley",null,null,{"$error":"#DIV/0!"},300,290,285,15,10,"Jeffrey M.","Donaldson","DUP","Hold","Jeffrey M.","Donaldson","DUP",null,null,"Same MP","Jeffrey M. Donaldson",null,{"$error":"#DIV/0!"},12.995789364245985,13,13,310,{"$f":"VLOOKUP(B325,'2022emp'!$A$2:$B$633,2,FALSE)","v":{"$error":"#N/A"}},{"$f":"VLOOKUP(B325,'2022emp'!$A$2:$F$633,4,FALSE)","v":{"$error":"#N/A"}},{"$f":"VLOOKUP(B325,'2022emp'!$A$2:$H$633,7,FALSE)","v":{"$error":"#N/A"}},{"$f":"VLOOKUP(B325,'2022emp'!$A$2:$H$633,8,FALSE)","v":{"$error":"#N/A"}},20,null,"Not Manufacturing Dependent",0]
["Scotland","Lanark and Hamilton East",4500,47000,9.5744680851063837,180,165,165,15,15,"Angela","Crawley","Scottish National Party","Hold","Angela","Crawley","Scottish National Party",4000,500,"Same MP","Angela Crawley",null,"Manufacturing Dependent",9.0909090909090917,9.1,9.1,180,{"$f":"VLOOKUP(B326,'2022emp'!$A$2:$B$633,2,FALSE)","v":4000},{"$f":"VLOOKUP(B326,'2022emp'!$A$2:$F$633,4,FALSE)","v":44000},{"$f":"VLOOKUP(B326,'2022emp'!$A$2:$H$633,7,FALSE)","v":3500},{"$f":"VLOOKUP(B326,'2022emp'!$A$2:$H$633,8,FALSE)","v":600},15,9.0909090909090917,"Manufacturing Dependent",9.1]
["North West","Lancaster and Fleetwood",2500,39000,6.4102564102564097,190,170,180,10,20,"Cat","Smith","Labour","Hold","Cat","Smith","Labour",2250,450,"Same MP","Cat Smith",null,"Not Manufacturing Dependent",6.4102564102564097,6.4,6.4,170,{"$f":"VLOOKUP(B327,'2022emp'!$A$2:$B$633,2,FALSE)","v":2500},{"$f":"VLOOKUP(B327,'2022emp'!$A$2:$F$633,4,FALSE)","v":40000},{"$f":"VLOOKUP(B327,'2022emp'!$A$2:$H$633,7,FALSE)","v":2250},{"$f":"VLOOKUP(B327,'2022emp'!$A$2:$H$633,8,FALSE)","v":450},0,6.25,"Not Manufacturing Dependent",6.3]
["Yorkshire & the Humber","Leeds Central",9000,217000,4.1474654377880187,355,345,345,10,10,"Hilary","Benn","Labour","Hold","Hilary","Benn","Labour",8000,1000,"Same MP","Hilary Benn",null,"Not Manufacturing Dependent",4.8672566371681416,4.9000000000000004,4.9000000000000004,370,{"$f":"VLOOKUP(B328,'2022emp'!$A$2:$B$633,2,FALSE)","v":11000},{"$f":"VLOOKUP(B328,'2022emp'!$A$2:$F$633,4,FALSE)","v":236000},{"$f":"VLOOKUP(B328,'2022emp'!$A$2:$H$633,7,FALSE)","v":10000},{"$f":"VLOOKUP(B328,'2022emp'!$A$2:$H$633,8,FALSE)","v":900},25,4.6610169491525424,"Not Manufacturing Dependent",4.7]
["Yorkshire & the Humber","Leeds East",3000,38000,7.8947368421052628,140,120,110,{"$f":"F329-H329","v":30},{"$f":"F329-G329","v":20},"Richard","Burgon","Labour","Hold","Richard","Burgon","Labour",3000,150,"Same MP",{"$f":"CONCATENATE(K329,\" \",L329)","v":"Richard Burgon"},null,{"$f":"IF(E329>24.29, \"Extremely Manufacturing Dependent\", IF(E329>16.59, \"Very Manufacturing Dependent\", IF(E329>8.09, \"Manufacturing Dependent\", \"Not Manufacturing Dependent\")))","v":"Not Manufacturing Dependent"},9.2105263157894726,9.1999999999999993,9.1999999999999993,150,{"$f":"VLOOKUP(B329,'2022emp'!$A$2:$B$633,2,FALSE)","v":3500},{"$f":"VLOOKUP(B329,'2022emp'!$A$2:$F$633,4,FALSE)","v":42000},{"$f":"VLOOKUP(B329,'2022emp'!$A$2:$H$633,7,FALSE)","v":3000},{"$f":"VLOOKUP(B329,'2022emp'!$A$2:$H$633,8,FALSE)","v":250},30,8.3333333333333321,"Not Manufacturing Dependent",8.3000000000000007]
["Yorkshire & the Humber","Leeds North East",300,21000,1.4285714285714286,70,70,65,5,0,"Fabian","Hamilton","Labour",{"$f":"IF(M330=Q330, \"Hold\", \"Change\")","v":"Hold"},"Fabian","Hamilton","Labour",225,50,{"$f":"IF(L330=P330, \"Same MP\", \"New MP\")","v":"Same MP"},"Fabian Hamilton",null,"Not Manufacturing Dependent",1.5,{"$f":"ROUND(X330,1)","v":1.5},1.5,75,{"$f":"VLOOKUP(B330,'2022emp'!$A$2:$B$633,2,FALSE)","v":300},{"$f":"VLOOKUP(B330,'2022emp'!$A$2:$F$633,4,FALSE)","v":22000},{"$f":"VLOOKUP(B330,'2022emp'!$A$2:$H$633,7,FALSE)","v":250},{"$f":"VLOOKUP(B330,'2022emp'!$A$2:$H$633,8,FALSE)","v":75},{"$f":"AA330-G330","v":5},{"$f":"(AB330/AC330)*100","v":1.3636363636363635},{"$f":"IF(AG330>26.79, \"Extremely Manufacturing Dependent\", IF(AG330>17.86, \"Very Manufacturing Dependent\", IF(AG330>8.93, \"Manufacturing Dependent\", \"Not Manufacturing Dependent\")))","v":"Not Manufacturing Dependent"},{"$f":"ROUND(AG330,1)","v":1.4}]
["Yorkshire & the Humber","Leeds North West",1250,26000,{"$f":"(C331/D331)*100","v":4.8076923076923084},125,110,110,15,15,"Alex","Sobel","Labour/Co-operative","Hold","Alex","Sobel","Labour/Co-operative",1250,100,"Same MP","Alex Sobel",null,"Not Manufacturing Dependent",5.3571428571428568,5.4,5.4,130,{"$f":"VLOOKUP(B331,'2022emp'!$A$2:$B$633,2,FALSE)","v":1500},{"$f":"VLOOKUP(B331,'2022emp'!$A$2:$F$633,4,FALSE)","v":28000},{"$f":"VLOOKUP(B331,'2022emp'!$A$2:$H$633,7,FALSE)","v":1250},{"$f":"VLOOKUP(B331,'2022emp'!$A$2:$H$633,8,FALSE)","v":125},20,5.3571428571428568,"Not Manufacturing Dependent",5.4]
["Yorkshire & the Humber","Leeds West",3000,49000,6.1224489795918364,225,240,230,-5,-15,"Rachel","Reeves","Labour","Hold","Rachel","Reeves","Labour",2500,400,"Same MP","Rachel Reeves",null,"Not Manufacturing Dependent",8.3333333333333321,8.3000000000000007,8.3000000000000007,230,{"$f":"VLOOKUP(B332,'2022emp'!$A$2:$B$633,2,FALSE)","v":4000},{"$f":"VLOOKUP(B332,'2022emp'!$A$2:$F$633,4,FALSE)","v":58000},{"$f":"VLOOKUP(B332,'2022emp'!$A$2:$H$633,7,FALSE)","v":3500},{"$f":"VLOOKUP(B332,'2022emp'!$A$2:$H$633,8,FALSE)","v":500},-10,6.8965517241379306,"Not Manufacturing Dependent",6.9]
["East Midlands","Leicester East",9000,37000,24.324324324324326,655,580,585,70,75,"Claudia","Webbe","Independent","Change","Claudia","Webbe","Labour",7000,1500,"Same MP","Claudia Webbe",null,"Extremely Manufacturing Dependent",21.621621621621621,21.6,21.6,515,{"$f":"VLOOKUP(B333,'2022emp'!$A$2:$B$633,2,FALSE)","v":10000},{"$f":"VLOOKUP(B333,'2022emp'!$A$2:$F$633,4,FALSE)","v":41000},{"$f":"VLOOKUP(B333,'2022emp'!$A$2:$H$633,7,FALSE)","v":9000},{"$f":"VLOOKUP(B333,'2022emp'!$A$2:$H$633,8,FALSE)","v":1000},-65,24.390243902439025,"Very Manufacturing Dependent",24.4]
["East Midlands","Leicester South",3000,84000,3.5714285714285712,445,375,380,65,70,"Jon","Ashworth","Labour","Hold","Jon","Ashworth","Labour",2500,600,"Same MP","Jon Ashworth",null,"Not Manufacturing Dependent",4.117647058823529,4.0999999999999996,4.0999999999999996,360,{"$f":"VLOOKUP(B334,'2022emp'!$A$2:$B$633,2,FALSE)","v":3500},{"$f":"VLOOKUP(B334,'2022emp'!$A$2:$F$633,4,FALSE)","v":90000},{"$f":"VLOOKUP(B334,'2022emp'!$A$2:$H$633,7,FALSE)","v":3000},{"$f":"VLOOKUP(B334,'2022emp'!$A$2:$H$633,8,FALSE)","v":450},-15,3.8888888888888888,"Not Manufacturing Dependent",3.9]
["East Midlands","Leicester West",7000,41000,17.073170731707318,285,270,265,20,15,"Liz","Kendall","Labour","Hold","Liz","Kendall","Labour",6000,800,"Same MP","Liz Kendall",null,"Very Manufacturing Dependent",19.047619047619047,19,19,245,{"$f":"VLOOKUP(B335,'2022emp'!$A$2:$B$633,2,FALSE)","v":7000},{"$f":"VLOOKUP(B335,'2022emp'!$A$2:$F$633,4,FALSE)","v":44000},{"$f":"VLOOKUP(B335,'2022emp'!$A$2:$H$633,7,FALSE)","v":7000},{"$f":"VLOOKUP(B335,'2022emp'!$A$2:$H$633,8,FALSE)","v":700},-25,15.909090909090908,"Manufacturing Dependent",15.9]
["North West","Leigh",3500,32000,10.9375,230,215,215,15,15,"James","Grundy","Conservative","Hold","James","Grundy","Conservative",3000,350,"Same MP","James Grundy",null,"Manufacturing Dependent",10.606060606060606,10.6,10.6,210,{"$f":"VLOOKUP(B336,'2022emp'!$A$2:$B$633,2,FALSE)","v":3500},{"$f":"VLOOKUP(B336,'2022emp'!$A$2:$F$633,4,FALSE)","v":35000},{"$f":"VLOOKUP(B336,'2022emp'!$A$2:$H$633,7,FALSE)","v":3000},{"$f":"VLOOKUP(B336,'2022emp'!$A$2:$H$633,8,FALSE)","v":600},-5,10,"Manufacturing Dependent",10]
["South East","Lewes",2250,35000,6.4285714285714279,275,265,280,-5,10,"Maria","Caulfield","Conservative","Hold","Maria","Caulfield","Conservative",2000,300,"Same MP","Maria Caulfield",null,"Not Manufacturing Dependent",6.25,6.3,6.3,280,{"$f":"VLOOKUP(B337,'2022emp'!$A$2:$B$633,2,FALSE)","v":2500},{"$f":"VLOOKUP(B337,'2022emp'!$A$2:$F$633,4,FALSE)","v":35000},{"$f":"VLOOKUP(B337,'2022emp'!$A$2:$H$633,7,FALSE)","v":2000},{"$f":"VLOOKUP(B337,'2022emp'!$A$2:$H$633,8,FALSE)","v":500},15,7.1428571428571423,"Not Manufacturing Dependent",7.1]
["London","Lewisham East",225,22000,1.0227272727272727,80,75,70,10,5,"Janet","Daby","Labour","Hold","Janet","Daby","Labour",175,40,"Same MP","Janet Daby",null,"Not Manufacturing Dependent",0.8,0.8,0.8,90,{"$f":"VLOOKUP(B338,'2022emp'!$A$2:$B$633,2,FALSE)","v":175},{"$f":"VLOOKUP(B338,'2022emp'!$A$2:$F$633,4,FALSE)","v":26000},{"$f":"VLOOKUP(B338,'2022emp'!$A$2:$H$633,7,FALSE)","v":150},{"$f":"VLOOKUP(B338,'2022emp'!$A$2:$H$633,8,FALSE)","v":30},15,0.67307692307692313,"Not Manufacturing Dependent",0.7]
["London","Lewisham West and Penge",600,22000,2.7272727272727271,150,145,140,10,5,"Ellie","Reeves","Labour","Hold","Ellie","Reeves","Labour",500,100,"Same MP","Ellie Reeves",null,"Not Manufacturing Dependent",2.6086956521739131,2.6,2.6,130,{"$f":"VLOOKUP(B339,'2022emp'!$A$2:$B$633,2,FALSE)","v":600},{"$f":"VLOOKUP(B339,'2022emp'!$A$2:$F$633,4,FALSE)","v":23000},{"$f":"VLOOKUP(B339,'2022emp'!$A$2:$H$633,7,FALSE)","v":500},{"$f":"VLOOKUP(B339,'2022emp'!$A$2:$H$633,8,FALSE)","v":75},-15,2.6086956521739131,"Not Manufacturing Dependent",2.6]
["London","Lewisham, Deptford",800,32000,2.5,140,140,135,5,0,"Vicky","Foxcroft","Labour","Hold","Vicky","Foxcroft","Labour",700,100,"Same MP","Vicky Foxcroft",null,"Not Manufacturing Dependent",2.258064516129032,2.2999999999999998,2.2999999999999998,135,{"$f":"VLOOKUP(B340,'2022emp'!$A$2:$B$633,2,FALSE)","v":900},{"$f":"VLOOKUP(B340,'2022emp'!$A$2:$F$633,4,FALSE)","v":33000},{"$f":"VLOOKUP(B340,'2022emp'!$A$2:$H$633,7,FALSE)","v":800},{"$f":"VLOOKUP(B340,'2022emp'!$A$2:$H$633,8,FALSE)","v":100},-5,2.7272727272727271,"Not Manufacturing Dependent",2.7]
["London","Leyton and Wanstead",500,28000,1.7857142857142856,125,100,120,5,25,"John","Cryer","Labour","Hold","John","Cryer","Labour",450,100,"Same MP","John Cryer",null,"Not Manufacturing Dependent",1.5517241379310345,1.6,1.6,155,{"$f":"VLOOKUP(B341,'2022emp'!$A$2:$B$633,2,FALSE)","v":600},{"$f":"VLOOKUP(B341,'2022emp'!$A$2:$F$633,4,FALSE)","v":29000},{"$f":"VLOOKUP(B341,'2022emp'!$A$2:$H$633,7,FALSE)","v":500},{"$f":"VLOOKUP(B341,'2022emp'!$A$2:$H$633,8,FALSE)","v":125},55,2.0689655172413794,"Not Manufacturing Dependent",2.1]
["West Midlands","Lichfield",5000,43000,11.627906976744185,280,270,275,5,10,"Michael","Fabricant","Conservative","Hold","Michael","Fabricant","Conservative",5000,400,"Same MP","Michael Fabricant",null,"Manufacturing Dependent",13.953488372093023,14,14,250,{"$f":"VLOOKUP(B342,'2022emp'!$A$2:$B$633,2,FALSE)","v":6000},{"$f":"VLOOKUP(B342,'2022emp'!$A$2:$F$633,4,FALSE)","v":47000},{"$f":"VLOOKUP(B342,'2022emp'!$A$2:$H$633,7,FALSE)","v":5000},{"$f":"VLOOKUP(B342,'2022emp'!$A$2:$H$633,8,FALSE)","v":500},-20,12.76595744680851,"Manufacturing Dependent",12.8]
["East Midlands","Lincoln",4500,57000,7.8947368421052628,145,155,155,-10,-10,"Karl","McCartney","Conservative","Hold","Karl","McCartney","Conservative",4000,450,"Same MP","Karl McCartney",null,"Not Manufacturing Dependent",7.6271186440677967,7.6,7.6,150,{"$f":"VLOOKUP(B343,'2022emp'!$A$2:$B$633,2,FALSE)","v":4500},{"$f":"VLOOKUP(B343,'2022emp'!$A$2:$F$633,4,FALSE)","v":60000},{"$f":"VLOOKUP(B343,'2022emp'!$A$2:$H$633,7,FALSE)","v":4000},{"$f":"VLOOKUP(B343,'2022emp'!$A$2:$H$633,8,FALSE)","v":300},-5,7.5,"Not Manufacturing Dependent",7.5]
["Scotland","Linlithgow and East Falkirk",6000,38000,15.789473684210526,155,155,150,5,0,"Martyn","Day","Scottish National Party","Hold","Martyn","Day","Scottish National Party",5000,600,"Same MP","Martyn Day",null,"Manufacturing Dependent",15,15,15,155,{"$f":"VLOOKUP(B344,'2022emp'!$A$2:$B$633,2,FALSE)","v":6000},{"$f":"VLOOKUP(B344,'2022emp'!$A$2:$F$633,4,FALSE)","v":39000},{"$f":"VLOOKUP(B344,'2022emp'!$A$2:$H$633,7,FALSE)","v":5000},{"$f":"VLOOKUP(B344,'2022emp'!$A$2:$H$633,8,FALSE)","v":700},0,15.384615384615385,"Manufacturing Dependent",15.4]
["North West","Liverpool, Riverside",3000,135000,2.2222222222222223,255,240,250,5,15,"Kim","Johnson","Labour","Hold","Kim","Johnson","Labour",2500,400,"Same MP","Kim Johnson",null,"Not Manufacturing Dependent",1.8656716417910446,1.9,1.9,275,{"$f":"VLOOKUP(B345,'2022emp'!$A$2:$B$633,2,FALSE)","v":3000},{"$f":"VLOOKUP(B345,'2022emp'!$A$2:$F$633,4,FALSE)","v":150000},{"$f":"VLOOKUP(B345,'2022emp'!$A$2:$H$633,7,FALSE)","v":2500},{"$f":"VLOOKUP(B345,'2022emp'!$A$2:$H$633,8,FALSE)","v":400},35,2,"Not Manufacturing Dependent",2]
["North West","Liverpool, Walton",2250,35000,6.4285714285714279,105,95,100,5,10,"Dan","Carden","Labour","Hold","Dan","Carden","Labour",2000,175,"Same MP","Dan Carden",null,"Not Manufacturing Dependent",5.1470588235294112,5.0999999999999996,5.0999999999999996,100,{"$f":"VLOOKUP(B346,'2022emp'!$A$2:$B$633,2,FALSE)","v":2000},{"$f":"VLOOKUP(B346,'2022emp'!$A$2:$F$633,4,FALSE)","v":40000},{"$f":"VLOOKUP(B346,'2022emp'!$A$2:$H$633,7,FALSE)","v":1750},{"$f":"VLOOKUP(B346,'2022emp'!$A$2:$H$633,8,FALSE)","v":350},5,5,"Not Manufacturing Dependent",5]
["North West","Liverpool, Wavertree",1000,28000,3.5714285714285712,70,75,90,-20,-5,"Paula","Barker","Labour","Hold","Paula","Barker","Labour",800,125,"Same MP","Paula Barker",null,"Not Manufacturing Dependent",3.8461538461538463,3.8,3.8,85,{"$f":"VLOOKUP(B347,'2022emp'!$A$2:$B$633,2,FALSE)","v":1500},{"$f":"VLOOKUP(B347,'2022emp'!$A$2:$F$633,4,FALSE)","v":27000},{"$f":"VLOOKUP(B347,'2022emp'!$A$2:$H$633,7,FALSE)","v":1250},{"$f":"VLOOKUP(B347,'2022emp'!$A$2:$H$633,8,FALSE)","v":350},10,5.5555555555555554,"Not Manufacturing Dependent",5.6]
["North West","Liverpool, West Derby",150,19000,0.78947368421052633,40,40,45,-5,0,"Ian","Byrne","Labour","Hold","Ian","Byrne","Labour",150,20,"Same MP","Ian Byrne",null,"Not Manufacturing Dependent",0.39473684210526316,0.4,0.4,35,{"$f":"VLOOKUP(B348,'2022emp'!$A$2:$B$633,2,FALSE)","v":100},{"$f":"VLOOKUP(B348,'2022emp'!$A$2:$F$633,4,FALSE)","v":19000},{"$f":"VLOOKUP(B348,'2022emp'!$A$2:$H$633,7,FALSE)","v":75},{"$f":"VLOOKUP(B348,'2022emp'!$A$2:$H$633,8,FALSE)","v":20},-5,0.52631578947368418,"Not Manufacturing Dependent",0.5]
["Scotland","Livingston",5000,54000,9.2592592592592595,190,190,200,-10,0,"Hannah","Bardell","Scottish National Party","Hold","Hannah","Bardell","Scottish National Party",5000,450,"Same MP","Hannah Bardell",null,"Manufacturing Dependent",9.2592592592592595,9.3000000000000007,9.3000000000000007,180,{"$f":"VLOOKUP(B349,'2022emp'!$A$2:$B$633,2,FALSE)","v":6000},{"$f":"VLOOKUP(B349,'2022emp'!$A$2:$F$633,4,FALSE)","v":55000},{"$f":"VLOOKUP(B349,'2022emp'!$A$2:$H$633,7,FALSE)","v":5000},{"$f":"VLOOKUP(B349,'2022emp'!$A$2:$H$633,8,FALSE)","v":350},-10,10.909090909090908,"Manufacturing Dependent",10.9]
["Wales","Llanelli",5000,28000,17.857142857142858,120,120,115,5,0,"Nia","Griffith","Labour","Hold","Nia","Griffith","Labour",4500,400,"Same MP","Nia Griffith",null,"Very Manufacturing Dependent",18.518518518518519,18.5,18.5,120,{"$f":"VLOOKUP(B350,'2022emp'!$A$2:$B$633,2,FALSE)","v":4000},{"$f":"VLOOKUP(B350,'2022emp'!$A$2:$F$633,4,FALSE)","v":28000},{"$f":"VLOOKUP(B350,'2022emp'!$A$2:$H$633,7,FALSE)","v":4000},{"$f":"VLOOKUP(B350,'2022emp'!$A$2:$H$633,8,FALSE)","v":400},0,14.285714285714285,"Manufacturing Dependent",14.3]
["East Midlands","Loughborough",7000,45000,15.555555555555555,265,340,270,-5,-75,"Jane","Hunt","Conservative","Hold","Jane","Hunt","Conservative",6000,450,"Same MP","Jane Hunt",null,"Manufacturing Dependent",13.636363636363635,13.6,13.6,245,{"$f":"VLOOKUP(B351,'2022emp'!$A$2:$B$633,2,FALSE)","v":6000},{"$f":"VLOOKUP(B351,'2022emp'!$A$2:$F$633,4,FALSE)","v":46000},{"$f":"VLOOKUP(B351,'2022emp'!$A$2:$H$633,7,FALSE)","v":5000},{"$f":"VLOOKUP(B351,'2022emp'!$A$2:$H$633,8,FALSE)","v":400},-95,13.043478260869565,"Manufacturing Dependent",13]
["East Midlands","Louth and Horncastle",3500,28000,12.5,230,220,215,15,10,"Victoria","Atkins","Conservative","Hold","Victoria","Atkins","Conservative",3500,250,"Same MP","Victoria Atkins",null,"Manufacturing Dependent",14.285714285714285,14.3,14.3,230,{"$f":"VLOOKUP(B352,'2022emp'!$A$2:$B$633,2,FALSE)","v":4000},{"$f":"VLOOKUP(B352,'2022emp'!$A$2:$F$633,4,FALSE)","v":30000},{"$f":"VLOOKUP(B352,'2022emp'!$A$2:$H$633,7,FALSE)","v":3500},{"$f":"VLOOKUP(B352,'2022emp'!$A$2:$H$633,8,FALSE)","v":300},10,13.333333333333334,"Manufacturing Dependent",13.3]
["West Midlands","Ludlow",4000,26000,15.384615384615385,290,295,300,-10,-5,"Philip","Dunne","Conservative","Hold","Philip","Dunne","Conservative",3500,300,"Same MP","Philip Dunne",null,"Manufacturing Dependent",15.384615384615385,15.4,15.4,285,{"$f":"VLOOKUP(B353,'2022emp'!$A$2:$B$633,2,FALSE)","v":4500},{"$f":"VLOOKUP(B353,'2022emp'!$A$2:$F$633,4,FALSE)","v":27000},{"$f":"VLOOKUP(B353,'2022emp'!$A$2:$H$633,7,FALSE)","v":4000},{"$f":"VLOOKUP(B353,'2022emp'!$A$2:$H$633,8,FALSE)","v":700},-10,16.666666666666664,"Manufacturing Dependent",16.7]
["Eastern","Luton North",1750,27000,6.481481481481481,115,120,115,0,-5,"Sarah","Owen","Labour","Hold","Sarah","Owen","Labour",1500,125,"Same MP","Sarah Owen",null,"Not Manufacturing Dependent",8.6538461538461533,8.6999999999999993,8.6999999999999993,115,{"$f":"VLOOKUP(B354,'2022emp'!$A$2:$B$633,2,FALSE)","v":1500},{"$f":"VLOOKUP(B354,'2022emp'!$A$2:$F$633,4,FALSE)","v":25000},{"$f":"VLOOKUP(B354,'2022emp'!$A$2:$H$633,7,FALSE)","v":1250},{"$f":"VLOOKUP(B354,'2022emp'!$A$2:$H$633,8,FALSE)","v":150},-5,6,"Not Manufacturing Dependent",6]
["Eastern","Luton South",5000,68000,7.3529411764705888,225,250,250,-25,-25,"Rachel","Hopkins","Labour","Hold","Rachel","Hopkins","Labour",4500,600,"Same MP","Rachel Hopkins",null,"Not Manufacturing Dependent",10.294117647058822,10.3,10.3,220,{"$f":"VLOOKUP(B355,'2022emp'!$A$2:$B$633,2,FALSE)","v":4500},{"$f":"VLOOKUP(B355,'2022emp'!$A$2:$F$633,4,FALSE)","v":85000},{"$f":"VLOOKUP(B355,'2022emp'!$A$2:$H$633,7,FALSE)","v":4500},{"$f":"VLOOKUP(B355,'2022emp'!$A$2:$H$633,8,FALSE)","v":350},-30,5.2941176470588234,"Not Manufacturing Dependent",5.3]
["North West","Macclesfield",7000,42000,16.666666666666664,260,260,255,5,0,"David","Rutley","Conservative","Hold","David","Rutley","Conservative",6000,700,"Same MP","David Rutley",null,"Very Manufacturing Dependent",8.3333333333333321,8.3000000000000007,8.3000000000000007,240,{"$f":"VLOOKUP(B356,'2022emp'!$A$2:$B$633,2,FALSE)","v":7000},{"$f":"VLOOKUP(B356,'2022emp'!$A$2:$F$633,4,FALSE)","v":43000},{"$f":"VLOOKUP(B356,'2022emp'!$A$2:$H$633,7,FALSE)","v":6000},{"$f":"VLOOKUP(B356,'2022emp'!$A$2:$H$633,8,FALSE)","v":500},-20,16.279069767441861,"Manufacturing Dependent",16.3]
["South East","Maidenhead",1500,57000,2.6315789473684208,260,250,240,20,10,"Theresa","May","Conservative","Hold","Theresa","May","Conservative",1500,175,"Same MP","Theresa May",null,"Not Manufacturing Dependent",3.5714285714285712,3.6,3.6,240,{"$f":"VLOOKUP(B357,'2022emp'!$A$2:$B$633,2,FALSE)","v":1750},{"$f":"VLOOKUP(B357,'2022emp'!$A$2:$F$633,4,FALSE)","v":55000},{"$f":"VLOOKUP(B357,'2022emp'!$A$2:$H$633,7,FALSE)","v":1500},{"$f":"VLOOKUP(B357,'2022emp'!$A$2:$H$633,8,FALSE)","v":225},-10,3.1818181818181817,"Not Manufacturing Dependent",3.2]
["South East","Maidstone and The Weald",2250,50000,4.5,240,225,225,15,15,"Helen","Grant","Conservative","Hold","Helen","Grant","Conservative",2000,225,"Same MP","Helen Grant",null,"Not Manufacturing Dependent",4.5,4.5,4.5,240,{"$f":"VLOOKUP(B358,'2022emp'!$A$2:$B$633,2,FALSE)","v":2250},{"$f":"VLOOKUP(B358,'2022emp'!$A$2:$F$633,4,FALSE)","v":51000},{"$f":"VLOOKUP(B358,'2022emp'!$A$2:$H$633,7,FALSE)","v":2000},{"$f":"VLOOKUP(B358,'2022emp'!$A$2:$H$633,8,FALSE)","v":250},15,4.4117647058823533,"Not Manufacturing Dependent",4.4000000000000004]
["North West","Makerfield",2250,21000,10.714285714285714,165,160,160,5,5,"Yvonne","Fovargue","Labour","Hold","Yvonne","Fovargue","Labour",2000,300,"Same MP","Yvonne Fovargue",null,"Manufacturing Dependent",9.0909090909090917,9.1,9.1,140,{"$f":"VLOOKUP(B359,'2022emp'!$A$2:$B$633,2,FALSE)","v":2500},{"$f":"VLOOKUP(B359,'2022emp'!$A$2:$F$633,4,FALSE)","v":22000},{"$f":"VLOOKUP(B359,'2022emp'!$A$2:$H$633,7,FALSE)","v":2250},{"$f":"VLOOKUP(B359,'2022emp'!$A$2:$H$633,8,FALSE)","v":300},-20,11.363636363636363,"Manufacturing Dependent",11.4]
["Eastern","Maldon",2500,29000,8.6206896551724146,330,330,330,0,0,"John","Whittingdale","Conservative","Hold","John","Whittingdale","Conservative",2250,350,"Same MP","John Whittingdale",null,"Manufacturing Dependent",10,10,10,325,{"$f":"VLOOKUP(B360,'2022emp'!$A$2:$B$633,2,FALSE)","v":3000},{"$f":"VLOOKUP(B360,'2022emp'!$A$2:$F$633,4,FALSE)","v":30000},{"$f":"VLOOKUP(B360,'2022emp'!$A$2:$H$633,7,FALSE)","v":2500},{"$f":"VLOOKUP(B360,'2022emp'!$A$2:$H$633,8,FALSE)","v":450},-5,10,"Manufacturing Dependent",10]
["North West","Manchester Central",8000,258000,3.1007751937984498,365,365,355,10,0,"Lucy","Powell","Labour/Co-operative","Hold","Lucy","Powell","Labour/Co-operative",6000,1500,"Same MP","Lucy Powell",null,"Not Manufacturing Dependent",2.4691358024691357,2.5,2.5,370,{"$f":"VLOOKUP(B361,'2022emp'!$A$2:$B$633,2,FALSE)","v":6000},{"$f":"VLOOKUP(B361,'2022emp'!$A$2:$F$633,4,FALSE)","v":275000},{"$f":"VLOOKUP(B361,'2022emp'!$A$2:$H$633,7,FALSE)","v":5000},{"$f":"VLOOKUP(B361,'2022emp'!$A$2:$H$633,8,FALSE)","v":900},5,2.1818181818181821,"Not Manufacturing Dependent",2.2000000000000002]
["North West","Manchester, Gorton",1000,21000,4.7619047619047619,85,75,75,10,10,"Afzal","Khan","Labour","Hold","Afzal","Khan","Labour",900,100,"Same MP","Afzal Khan",null,"Not Manufacturing Dependent",4.0909090909090908,4.0999999999999996,4.0999999999999996,95,{"$f":"VLOOKUP(B362,'2022emp'!$A$2:$B$633,2,FALSE)","v":1000},{"$f":"VLOOKUP(B362,'2022emp'!$A$2:$F$633,4,FALSE)","v":22000},{"$f":"VLOOKUP(B362,'2022emp'!$A$2:$H$633,7,FALSE)","v":1000},{"$f":"VLOOKUP(B362,'2022emp'!$A$2:$H$633,8,FALSE)","v":125},20,4.5454545454545459,"Not Manufacturing Dependent",4.5]
["North West","Manchester, Withington",1000,29000,3.4482758620689653,80,95,85,-5,-15,"Jeff","Smith","Labour","Hold","Jeff","Smith","Labour",800,200,"Same MP","Jeff Smith",null,"Not Manufacturing Dependent",1.7241379310344827,1.7,1.7,80,{"$f":"VLOOKUP(B363,'2022emp'!$A$2:$B$633,2,FALSE)","v":800},{"$f":"VLOOKUP(B363,'2022emp'!$A$2:$F$633,4,FALSE)","v":31000},{"$f":"VLOOKUP(B363,'2022emp'!$A$2:$H$633,7,FALSE)","v":700},{"$f":"VLOOKUP(B363,'2022emp'!$A$2:$H$633,8,FALSE)","v":75},-15,2.5806451612903225,"Not Manufacturing Dependent",2.6]
["East Midlands","Mansfield",4000,40000,10,200,200,190,10,0,"Ben","Bradley","Conservative","Hold","Ben","Bradley","Conservative",4000,400,"Same MP","Ben Bradley",null,"Manufacturing Dependent",10,10,10,205,{"$f":"VLOOKUP(B364,'2022emp'!$A$2:$B$633,2,FALSE)","v":4000},{"$f":"VLOOKUP(B364,'2022emp'!$A$2:$F$633,4,FALSE)","v":44000},{"$f":"VLOOKUP(B364,'2022emp'!$A$2:$H$633,7,FALSE)","v":4000},{"$f":"VLOOKUP(B364,'2022emp'!$A$2:$H$633,8,FALSE)","v":350},5,9.0909090909090917,"Manufacturing Dependent",9.1]
["South East","Meon Valley",4000,50000,8,295,320,335,-40,-25,"Flick","Drummond","Conservative","Hold","Flick","Drummond","Conservative",3500,450,"Same MP","Flick Drummond",null,"Not Manufacturing Dependent",9.375,9.4,9.4,290,{"$f":"VLOOKUP(B365,'2022emp'!$A$2:$B$633,2,FALSE)","v":3500},{"$f":"VLOOKUP(B365,'2022emp'!$A$2:$F$633,4,FALSE)","v":58000},{"$f":"VLOOKUP(B365,'2022emp'!$A$2:$H$633,7,FALSE)","v":3000},{"$f":"VLOOKUP(B365,'2022emp'!$A$2:$H$633,8,FALSE)","v":350},-30,6.0344827586206895,"Not Manufacturing Dependent",6]
["West Midlands","Meriden",2000,84000,2.3809523809523809,150,170,170,-20,-20,"Saqib","Bhatti","Conservative","Hold","Saqib","Bhatti","Conservative",1750,125,"Same MP","Saqib Bhatti",null,"Not Manufacturing Dependent",3.0769230769230771,3.1,3.1,150,{"$f":"VLOOKUP(B366,'2022emp'!$A$2:$B$633,2,FALSE)","v":4500},{"$f":"VLOOKUP(B366,'2022emp'!$A$2:$F$633,4,FALSE)","v":93000},{"$f":"VLOOKUP(B366,'2022emp'!$A$2:$H$633,7,FALSE)","v":4000},{"$f":"VLOOKUP(B366,'2022emp'!$A$2:$H$633,8,FALSE)","v":200},-20,4.838709677419355,"Not Manufacturing Dependent",4.8]
["Wales","Merthyr Tydfil and Rhymney",3500,27000,12.962962962962962,85,85,90,-5,0,"Gerald","Jones","Labour","Hold","Gerald","Jones","Labour",3500,100,"Same MP","Gerald Jones",null,"Manufacturing Dependent",14.583333333333334,14.6,14.6,85,{"$f":"VLOOKUP(B367,'2022emp'!$A$2:$B$633,2,FALSE)","v":3000},{"$f":"VLOOKUP(B367,'2022emp'!$A$2:$F$633,4,FALSE)","v":24000},{"$f":"VLOOKUP(B367,'2022emp'!$A$2:$H$633,7,FALSE)","v":3000},{"$f":"VLOOKUP(B367,'2022emp'!$A$2:$H$633,8,FALSE)","v":200},0,12.5,"Manufacturing Dependent",12.5]
["Eastern","Mid Bedfordshire",3000,42000,7.1428571428571423,265,255,260,5,10,"Alistair","Strathern","Labour","Change","Nadine","Dorries","Conservative",2500,250,"New MP","Alistair Strathern",null,"Not Manufacturing Dependent",6.4102564102564097,6.4,6.4,270,{"$f":"VLOOKUP(B368,'2022emp'!$A$2:$B$633,2,FALSE)","v":3000},{"$f":"VLOOKUP(B368,'2022emp'!$A$2:$F$633,4,FALSE)","v":43000},{"$f":"VLOOKUP(B368,'2022emp'!$A$2:$H$633,7,FALSE)","v":2500},{"$f":"VLOOKUP(B368,'2022emp'!$A$2:$H$633,8,FALSE)","v":300},15,6.9767441860465116,"Not Manufacturing Dependent",7]
["East Midlands","Mid Derbyshire",1000,20000,5,145,135,135,10,10,"Pauline","Latham","Conservative","Hold","Pauline","Latham","Conservative",1000,50,"Same MP","Pauline Latham",null,"Not Manufacturing Dependent",5.6818181818181817,5.7,5.7,105,{"$f":"VLOOKUP(B369,'2022emp'!$A$2:$B$633,2,FALSE)","v":900},{"$f":"VLOOKUP(B369,'2022emp'!$A$2:$F$633,4,FALSE)","v":22000},{"$f":"VLOOKUP(B369,'2022emp'!$A$2:$H$633,7,FALSE)","v":800},{"$f":"VLOOKUP(B369,'2022emp'!$A$2:$H$633,8,FALSE)","v":75},-30,4.0909090909090908,"Not Manufacturing Dependent",4.0999999999999996]
["South West","Mid Dorset and North Poole",5000,28000,17.857142857142858,290,275,270,20,15,"Michael","Tomlinson","Conservative","Hold","Michael","Tomlinson","Conservative",4500,300,"Same MP","Michael Tomlinson",null,"Very Manufacturing Dependent",15.517241379310345,15.5,15.5,285,{"$f":"VLOOKUP(B370,'2022emp'!$A$2:$B$633,2,FALSE)","v":4000},{"$f":"VLOOKUP(B370,'2022emp'!$A$2:$F$633,4,FALSE)","v":30000},{"$f":"VLOOKUP(B370,'2022emp'!$A$2:$H$633,7,FALSE)","v":4000},{"$f":"VLOOKUP(B370,'2022emp'!$A$2:$H$633,8,FALSE)","v":300},10,13.333333333333334,"Manufacturing Dependent",13.3]
["Eastern","Mid Norfolk",3500,36000,9.7222222222222232,260,265,260,0,-5,"George","Freeman","Conservative","Hold","George","Freeman","Conservative",3500,225,"Same MP","George Freeman",null,"Manufacturing Dependent",12.121212121212121,12.1,12.1,265,{"$f":"VLOOKUP(B371,'2022emp'!$A$2:$B$633,2,FALSE)","v":4000},{"$f":"VLOOKUP(B371,'2022emp'!$A$2:$F$633,4,FALSE)","v":36000},{"$f":"VLOOKUP(B371,'2022emp'!$A$2:$H$633,7,FALSE)","v":3500},{"$f":"VLOOKUP(B371,'2022emp'!$A$2:$H$633,8,FALSE)","v":500},0,11.111111111111111,"Manufacturing Dependent",11.1]
["South East","Mid Sussex",2500,46000,5.4347826086956523,240,260,250,-10,-20,"Mims","Davies","Conservative","Hold","Mims","Davies","Conservative",2250,500,"Same MP","Mims Davies",null,"Not Manufacturing Dependent",6.666666666666667,6.7,6.7,250,{"$f":"VLOOKUP(B372,'2022emp'!$A$2:$B$633,2,FALSE)","v":2500},{"$f":"VLOOKUP(B372,'2022emp'!$A$2:$F$633,4,FALSE)","v":47000},{"$f":"VLOOKUP(B372,'2022emp'!$A$2:$H$633,7,FALSE)","v":2250},{"$f":"VLOOKUP(B372,'2022emp'!$A$2:$H$633,8,FALSE)","v":450},-10,5.3191489361702127,"Not Manufacturing Dependent",5.3]
["Northern Ireland","Mid Ulster",null,null,{"$error":"#DIV/0!"},510,475,495,15,35,"Francie","Molloy","Sinn Fein","Hold","Francie","Molloy","Sinn Fein",null,null,"Same MP","Francie Molloy",null,{"$error":"#DIV/0!"},26.636900390682371,26.6,26.6,545,{"$f":"VLOOKUP(B373,'2022emp'!$A$2:$B$633,2,FALSE)","v":{"$error":"#N/A"}},{"$f":"VLOOKUP(B373,'2022emp'!$A$2:$F$633,4,FALSE)","v":{"$error":"#N/A"}},{"$f":"VLOOKUP(B373,'2022emp'!$A$2:$H$633,7,FALSE)","v":{"$error":"#N/A"}},{"$f":"VLOOKUP(B373,'2022emp'!$A$2:$H$633,8,FALSE)","v":{"$error":"#N/A"}},70,null,"Not Manufacturing Dependent",0]
["West Midlands","Mid Worcestershire",7000,42000,16.666666666666664,315,295,320,-5,20,"Nigel","Huddleston","Conservative","Hold","Nigel","Huddleston","Conservative",6000,1000,"Same MP","Nigel Huddleston",null,"Very Manufacturing Dependent",19.047619047619047,19,19,305,{"$f":"VLOOKUP(B374,'2022emp'!$A$2:$B$633,2,FALSE)","v":7000},{"$f":"VLOOKUP(B374,'2022emp'!$A$2:$F$633,4,FALSE)","v":45000},{"$f":"VLOOKUP(B374,'2022emp'!$A$2:$H$633,7,FALSE)","v":7000},{"$f":"VLOOKUP(B374,'2022emp'!$A$2:$H$633,8,FALSE)","v":900},10,15.555555555555555,"Manufacturing Dependent",15.6]
["North East","Middlesbrough",2500,52000,4.8076923076923084,170,135,155,15,35,"Andy","McDonald","Labour","Hold","Andy","McDonald","Labour",2250,150,"Same MP","Andy McDonald",null,"Not Manufacturing Dependent",5.6603773584905666,5.7,5.7,155,{"$f":"VLOOKUP(B375,'2022emp'!$A$2:$B$633,2,FALSE)","v":2500},{"$f":"VLOOKUP(B375,'2022emp'!$A$2:$F$633,4,FALSE)","v":57000},{"$f":"VLOOKUP(B375,'2022emp'!$A$2:$H$633,7,FALSE)","v":2250},{"$f":"VLOOKUP(B375,'2022emp'!$A$2:$H$633,8,FALSE)","v":350},20,4.3859649122807012,"Not Manufacturing Dependent",4.4000000000000004]
["North East","Middlesbrough South and East Cleveland",1000,16000,6.25,135,120,135,0,15,"Simon","Clarke","Conservative","Hold","Simon","Clarke","Conservative",1000,75,"Same MP","Simon Clarke",null,"Not Manufacturing Dependent",6.25,6.3,6.3,105,{"$f":"VLOOKUP(B376,'2022emp'!$A$2:$B$633,2,FALSE)","v":1000},{"$f":"VLOOKUP(B376,'2022emp'!$A$2:$F$633,4,FALSE)","v":17000},{"$f":"VLOOKUP(B376,'2022emp'!$A$2:$H$633,7,FALSE)","v":900},{"$f":"VLOOKUP(B376,'2022emp'!$A$2:$H$633,8,FALSE)","v":125},-15,5.8823529411764701,"Not Manufacturing Dependent",5.9]
["Scotland","Midlothian",2500,30000,8.3333333333333321,165,150,155,10,15,"Owen","Thompson","Scottish National Party","Hold","Owen","Thompson","Scottish National Party",2500,250,"Same MP","Owen Thompson",null,"Manufacturing Dependent",9.67741935483871,9.6999999999999993,9.6999999999999993,165,{"$f":"VLOOKUP(B377,'2022emp'!$A$2:$B$633,2,FALSE)","v":2500},{"$f":"VLOOKUP(B377,'2022emp'!$A$2:$F$633,4,FALSE)","v":33000},{"$f":"VLOOKUP(B377,'2022emp'!$A$2:$H$633,7,FALSE)","v":2250},{"$f":"VLOOKUP(B377,'2022emp'!$A$2:$H$633,8,FALSE)","v":250},15,7.5757575757575761,"Not Manufacturing Dependent",7.6]
["South East","Milton Keynes North",4500,89000,5.0561797752808983,295,275,270,25,20,"Ben","Everitt","Conservative","Hold","Ben","Everitt","Conservative",4000,350,"Same MP","Ben Everitt",null,"Not Manufacturing Dependent",4.7872340425531918,4.8,4.8,275,{"$f":"VLOOKUP(B378,'2022emp'!$A$2:$B$633,2,FALSE)","v":4500},{"$f":"VLOOKUP(B378,'2022emp'!$A$2:$F$633,4,FALSE)","v":91000},{"$f":"VLOOKUP(B378,'2022emp'!$A$2:$H$633,7,FALSE)","v":4000},{"$f":"VLOOKUP(B378,'2022emp'!$A$2:$H$633,8,FALSE)","v":450},0,4.9450549450549453,"Not Manufacturing Dependent",4.9000000000000004]
["South East","Milton Keynes South",5000,86000,5.8139534883720927,280,265,265,15,15,"Iain","Stewart","Conservative","Hold","Iain","Stewart","Conservative",4500,400,"Same MP","Iain Stewart",null,"Not Manufacturing Dependent",6.8181818181818175,6.8,6.8,245,{"$f":"VLOOKUP(B379,'2022emp'!$A$2:$B$633,2,FALSE)","v":6000},{"$f":"VLOOKUP(B379,'2022emp'!$A$2:$F$633,4,FALSE)","v":89000},{"$f":"VLOOKUP(B379,'2022emp'!$A$2:$H$633,7,FALSE)","v":5000},{"$f":"VLOOKUP(B379,'2022emp'!$A$2:$H$633,8,FALSE)","v":500},-20,6.7415730337078648,"Not Manufacturing Dependent",6.7]
["London","Mitcham and Morden",1500,21000,7.1428571428571423,160,165,165,-5,-5,"Siobhain","McDonagh","Labour","Hold","Siobhain","McDonagh","Labour",1250,200,"Same MP","Siobhain McDonagh",null,"Not Manufacturing Dependent",7.1428571428571423,7.1,7.1,170,{"$f":"VLOOKUP(B380,'2022emp'!$A$2:$B$633,2,FALSE)","v":1250},{"$f":"VLOOKUP(B380,'2022emp'!$A$2:$F$633,4,FALSE)","v":22000},{"$f":"VLOOKUP(B380,'2022emp'!$A$2:$H$633,7,FALSE)","v":1250},{"$f":"VLOOKUP(B380,'2022emp'!$A$2:$H$633,8,FALSE)","v":175},5,5.6818181818181817,"Not Manufacturing Dependent",5.7]
["South East","Mole Valley",3000,49000,6.1224489795918364,235,220,240,-5,15,"Paul","Beresford","Conservative","Hold","Paul","Beresford","Conservative",2500,400,"Same MP","Paul Beresford",null,"Not Manufacturing Dependent",6,6,6,220,{"$f":"VLOOKUP(B381,'2022emp'!$A$2:$B$633,2,FALSE)","v":1750},{"$f":"VLOOKUP(B381,'2022emp'!$A$2:$F$633,4,FALSE)","v":50000},{"$f":"VLOOKUP(B381,'2022emp'!$A$2:$H$633,7,FALSE)","v":1500},{"$f":"VLOOKUP(B381,'2022emp'!$A$2:$H$633,8,FALSE)","v":300},0,3.5000000000000004,"Not Manufacturing Dependent",3.5]
["Wales","Monmouth",3000,33000,9.0909090909090917,200,190,195,5,10,"David","Davies","Conservative","Hold","David","Davies","Conservative",2500,225,"Same MP","David Davies",null,"Manufacturing Dependent",8.8235294117647065,8.8000000000000007,8.8000000000000007,210,{"$f":"VLOOKUP(B382,'2022emp'!$A$2:$B$633,2,FALSE)","v":3000},{"$f":"VLOOKUP(B382,'2022emp'!$A$2:$F$633,4,FALSE)","v":36000},{"$f":"VLOOKUP(B382,'2022emp'!$A$2:$H$633,7,FALSE)","v":3000},{"$f":"VLOOKUP(B382,'2022emp'!$A$2:$H$633,8,FALSE)","v":350},20,8.3333333333333321,"Not Manufacturing Dependent",8.3000000000000007]
["Wales","Montgomeryshire",4000,22000,18.181818181818183,210,190,190,20,20,"Craig","Williams","Conservative","Hold","Craig","Williams","Conservative",3500,400,"Same MP","Craig Williams",null,"Very Manufacturing Dependent",18.181818181818183,18.2,18.2,220,{"$f":"VLOOKUP(B383,'2022emp'!$A$2:$B$633,2,FALSE)","v":4500},{"$f":"VLOOKUP(B383,'2022emp'!$A$2:$F$633,4,FALSE)","v":22000},{"$f":"VLOOKUP(B383,'2022emp'!$A$2:$H$633,7,FALSE)","v":4000},{"$f":"VLOOKUP(B383,'2022emp'!$A$2:$H$633,8,FALSE)","v":500},30,20.454545454545457,"Very Manufacturing Dependent",20.5]
["Scotland","Moray",6000,34000,17.647058823529413,210,180,185,25,30,"Douglas","Ross","Conservative","Hold","Douglas","Ross","Conservative",6000,600,"Same MP","Douglas Ross",null,"Very Manufacturing Dependent",17.142857142857142,17.100000000000001,17.100000000000001,190,{"$f":"VLOOKUP(B384,'2022emp'!$A$2:$B$633,2,FALSE)","v":6000},{"$f":"VLOOKUP(B384,'2022emp'!$A$2:$F$633,4,FALSE)","v":36000},{"$f":"VLOOKUP(B384,'2022emp'!$A$2:$H$633,7,FALSE)","v":5000},{"$f":"VLOOKUP(B384,'2022emp'!$A$2:$H$633,8,FALSE)","v":800},10,16.666666666666664,"Manufacturing Dependent",16.7]
["North West","Morecambe and Lunesdale",1500,25000,6,150,145,160,-10,5,"David","Morris","Conservative","Hold","David","Morris","Conservative",1500,200,"Same MP","David Morris",null,"Not Manufacturing Dependent",5.7692307692307692,5.8,5.8,145,{"$f":"VLOOKUP(B385,'2022emp'!$A$2:$B$633,2,FALSE)","v":1500},{"$f":"VLOOKUP(B385,'2022emp'!$A$2:$F$633,4,FALSE)","v":27000},{"$f":"VLOOKUP(B385,'2022emp'!$A$2:$H$633,7,FALSE)","v":1500},{"$f":"VLOOKUP(B385,'2022emp'!$A$2:$H$633,8,FALSE)","v":175},0,5.5555555555555554,"Not Manufacturing Dependent",5.6]
["Yorkshire & the Humber","Morley and Outwood",3500,52000,6.7307692307692308,215,235,220,-5,-20,"Andrea","Jenkyns","Conservative","Hold","Andrea","Jenkyns","Conservative",3000,250,"Same MP","Andrea Jenkyns",null,"Not Manufacturing Dependent",6.8627450980392162,6.9,6.9,215,{"$f":"VLOOKUP(B386,'2022emp'!$A$2:$B$633,2,FALSE)","v":3500},{"$f":"VLOOKUP(B386,'2022emp'!$A$2:$F$633,4,FALSE)","v":50000},{"$f":"VLOOKUP(B386,'2022emp'!$A$2:$H$633,7,FALSE)","v":3000},{"$f":"VLOOKUP(B386,'2022emp'!$A$2:$H$633,8,FALSE)","v":300},-20,7.0000000000000009,"Not Manufacturing Dependent",7]
["Scotland","Motherwell and Wishaw",1500,28000,5.3571428571428568,105,105,110,-5,0,"Marion","Fellows","Scottish National Party","Hold","Marion","Fellows","Scottish National Party",1500,200,"Same MP","Marion Fellows",null,"Not Manufacturing Dependent",6.481481481481481,6.5,6.5,100,{"$f":"VLOOKUP(B387,'2022emp'!$A$2:$B$633,2,FALSE)","v":1250},{"$f":"VLOOKUP(B387,'2022emp'!$A$2:$F$633,4,FALSE)","v":28000},{"$f":"VLOOKUP(B387,'2022emp'!$A$2:$H$633,7,FALSE)","v":1250},{"$f":"VLOOKUP(B387,'2022emp'!$A$2:$H$633,8,FALSE)","v":100},-5,4.4642857142857144,"Not Manufacturing Dependent",4.5]
["Scotland","Na h-Eileanan An Iar",800,11000,7.2727272727272725,70,85,75,-5,-15,"Angus","MacNeil","Independent","Change","Angus","MacNeil","Scottish National Party",600,150,"Same MP","Angus MacNeil",null,"Not Manufacturing Dependent",6.3636363636363633,6.4,6.4,60,{"$f":"VLOOKUP(B388,'2022emp'!$A$2:$B$633,2,FALSE)","v":900},{"$f":"VLOOKUP(B388,'2022emp'!$A$2:$F$633,4,FALSE)","v":11000},{"$f":"VLOOKUP(B388,'2022emp'!$A$2:$H$633,7,FALSE)","v":800},{"$f":"VLOOKUP(B388,'2022emp'!$A$2:$H$633,8,FALSE)","v":125},-25,8.1818181818181817,"Not Manufacturing Dependent",8.1999999999999993]
["Wales","Neath",1500,16000,9.375,100,100,110,-10,0,"Christina","Rees","Independent","Change","Christina","Rees","Labour/Co-operative",1500,100,"Same MP","Christina Rees",null,"Manufacturing Dependent",9.375,9.4,9.4,100,{"$f":"VLOOKUP(B389,'2022emp'!$A$2:$B$633,2,FALSE)","v":1500},{"$f":"VLOOKUP(B389,'2022emp'!$A$2:$F$633,4,FALSE)","v":16000},{"$f":"VLOOKUP(B389,'2022emp'!$A$2:$H$633,7,FALSE)","v":1500},{"$f":"VLOOKUP(B389,'2022emp'!$A$2:$H$633,8,FALSE)","v":75},0,9.375,"Manufacturing Dependent",9.4]
["South East","New Forest East",4000,35000,11.428571428571429,220,215,215,5,5,"Julian","Lewis","Conservative","Hold","Julian","Lewis","Conservative",3500,350,"Same MP","Julian Lewis",null,"Manufacturing Dependent",9.7222222222222232,9.6999999999999993,9.6999999999999993,210,{"$f":"VLOOKUP(B390,'2022emp'!$A$2:$B$633,2,FALSE)","v":3500},{"$f":"VLOOKUP(B390,'2022emp'!$A$2:$F$633,4,FALSE)","v":36000},{"$f":"VLOOKUP(B390,'2022emp'!$A$2:$H$633,7,FALSE)","v":3500},{"$f":"VLOOKUP(B390,'2022emp'!$A$2:$H$633,8,FALSE)","v":300},-5,9.7222222222222232,"Manufacturing Dependent",9.6999999999999993]
["South East","New Forest West",2500,32000,7.8125,270,270,280,-10,0,"Desmond","Swayne","Conservative","Hold","Desmond","Swayne","Conservative",2250,300,"Same MP","Desmond Swayne",null,"Not Manufacturing Dependent",9.0909090909090917,9.1,9.1,265,{"$f":"VLOOKUP(B391,'2022emp'!$A$2:$B$633,2,FALSE)","v":2500},{"$f":"VLOOKUP(B391,'2022emp'!$A$2:$F$633,4,FALSE)","v":35000},{"$f":"VLOOKUP(B391,'2022emp'!$A$2:$H$633,7,FALSE)","v":2250},{"$f":"VLOOKUP(B391,'2022emp'!$A$2:$H$633,8,FALSE)","v":300},-5,7.1428571428571423,"Not Manufacturing Dependent",7.1]
["East Midlands","Newark",6000,44000,13.636363636363635,280,270,270,10,10,"Robert","Jenrick","Conservative","Hold","Robert","Jenrick","Conservative",4500,800,"Same MP","Robert Jenrick",null,"Manufacturing Dependent",11.627906976744185,11.6,11.6,280,{"$f":"VLOOKUP(B392,'2022emp'!$A$2:$B$633,2,FALSE)","v":6000},{"$f":"VLOOKUP(B392,'2022emp'!$A$2:$F$633,4,FALSE)","v":47000},{"$f":"VLOOKUP(B392,'2022emp'!$A$2:$H$633,7,FALSE)","v":5000},{"$f":"VLOOKUP(B392,'2022emp'!$A$2:$H$633,8,FALSE)","v":1000},10,12.76595744680851,"Manufacturing Dependent",12.8]
["South East","Newbury",10000,70000,14.285714285714285,310,325,320,{"$f":"F393-H393","v":-10},{"$f":"F393-G393","v":-15},"Laura","Farris","Conservative","Hold","Laura","Farris","Conservative",9000,700,"Same MP",{"$f":"CONCATENATE(K393,\" \",L393)","v":"Laura Farris"},null,{"$f":"IF(E393>24.29, \"Extremely Manufacturing Dependent\", IF(E393>16.59, \"Very Manufacturing Dependent\", IF(E393>8.09, \"Manufacturing Dependent\", \"Not Manufacturing Dependent\")))","v":"Manufacturing Dependent"},12.5,12.5,12.5,310,{"$f":"VLOOKUP(B393,'2022emp'!$A$2:$B$633,2,FALSE)","v":9000},{"$f":"VLOOKUP(B393,'2022emp'!$A$2:$F$633,4,FALSE)","v":70000},{"$f":"VLOOKUP(B393,'2022emp'!$A$2:$H$633,7,FALSE)","v":9000},{"$f":"VLOOKUP(B393,'2022emp'!$A$2:$H$633,8,FALSE)","v":700},-15,12.857142857142856,"Manufacturing Dependent",12.9]
["North East","Newcastle upon Tyne Central",1250,95000,1.3157894736842104,120,110,105,15,10,"Chi","Onwurah","Labour",{"$f":"IF(M394=Q394, \"Hold\", \"Change\")","v":"Hold"},"Chi","Onwurah","Labour",1250,100,{"$f":"IF(L394=P394, \"Same MP\", \"New MP\")","v":"Same MP"},"Chi Onwurah",null,"Not Manufacturing Dependent",1.5306122448979591,{"$f":"ROUND(X394,1)","v":1.5},1.5,115,{"$f":"VLOOKUP(B394,'2022emp'!$A$2:$B$633,2,FALSE)","v":1000},{"$f":"VLOOKUP(B394,'2022emp'!$A$2:$F$633,4,FALSE)","v":102000},{"$f":"VLOOKUP(B394,'2022emp'!$A$2:$H$633,7,FALSE)","v":1000},{"$f":"VLOOKUP(B394,'2022emp'!$A$2:$H$633,8,FALSE)","v":125},{"$f":"AA394-G394","v":5},{"$f":"(AB394/AC394)*100","v":0.98039215686274506},{"$f":"IF(AG394>26.79, \"Extremely Manufacturing Dependent\", IF(AG394>17.86, \"Very Manufacturing Dependent\", IF(AG394>8.93, \"Manufacturing Dependent\", \"Not Manufacturing Dependent\")))","v":"Not Manufacturing Dependent"},{"$f":"ROUND(AG394,1)","v":1}]
["North East","Newcastle upon Tyne East",3000,55000,{"$f":"(C395/D395)*100","v":5.4545454545454541},120,105,110,10,15,"Nick","Brown","Independent","Change","Nick","Brown","Labour",2500,100,"Same MP","Nick Brown",null,"Not Manufacturing Dependent",6.3636363636363633,6.4,6.4,105,{"$f":"VLOOKUP(B395,'2022emp'!$A$2:$B$633,2,FALSE)","v":3000},{"$f":"VLOOKUP(B395,'2022emp'!$A$2:$F$633,4,FALSE)","v":58000},{"$f":"VLOOKUP(B395,'2022emp'!$A$2:$H$633,7,FALSE)","v":3000},{"$f":"VLOOKUP(B395,'2022emp'!$A$2:$H$633,8,FALSE)","v":175},0,5.1724137931034484,"Not Manufacturing Dependent",5.2]
["North East","Newcastle upon Tyne North",2000,30000,6.666666666666667,125,125,115,10,0,"Catherine","McKinnell","Labour","Hold","Catherine","McKinnell","Labour",1750,75,"Same MP","Catherine McKinnell",null,"Not Manufacturing Dependent",7.5,7.5,7.5,125,{"$f":"VLOOKUP(B396,'2022emp'!$A$2:$B$633,2,FALSE)","v":2250},{"$f":"VLOOKUP(B396,'2022emp'!$A$2:$F$633,4,FALSE)","v":30000},{"$f":"VLOOKUP(B396,'2022emp'!$A$2:$H$633,7,FALSE)","v":2250},{"$f":"VLOOKUP(B396,'2022emp'!$A$2:$H$633,8,FALSE)","v":150},0,7.5,"Not Manufacturing Dependent",7.5]
["West Midlands","Newcastle-under-Lyme",3000,37000,8.1081081081081088,170,170,180,-10,0,"Aaron","Bell","Conservative","Hold","Aaron","Bell","Conservative",3000,250,"Same MP","Aaron Bell",null,"Manufacturing Dependent",9.2105263157894726,9.1999999999999993,9.1999999999999993,160,{"$f":"VLOOKUP(B397,'2022emp'!$A$2:$B$633,2,FALSE)","v":3500},{"$f":"VLOOKUP(B397,'2022emp'!$A$2:$F$633,4,FALSE)","v":39000},{"$f":"VLOOKUP(B397,'2022emp'!$A$2:$H$633,7,FALSE)","v":3500},{"$f":"VLOOKUP(B397,'2022emp'!$A$2:$H$633,8,FALSE)","v":350},-10,8.9743589743589745,"Manufacturing Dependent",9]
["Wales","Newport East",4500,27000,16.666666666666664,130,110,125,5,20,"Jessica","Morden","Labour","Hold","Jessica","Morden","Labour",4000,300,"Same MP","Jessica Morden",null,"Very Manufacturing Dependent",16.666666666666664,16.7,16.7,120,{"$f":"VLOOKUP(B398,'2022emp'!$A$2:$B$633,2,FALSE)","v":5000},{"$f":"VLOOKUP(B398,'2022emp'!$A$2:$F$633,4,FALSE)","v":28000},{"$f":"VLOOKUP(B398,'2022emp'!$A$2:$H$633,7,FALSE)","v":4500},{"$f":"VLOOKUP(B398,'2022emp'!$A$2:$H$633,8,FALSE)","v":300},10,17.857142857142858,"Manufacturing Dependent",17.899999999999999]
["Wales","Newport West",3500,54000,6.481481481481481,130,125,130,0,5,"Ruth","Jones","Labour","Hold","Ruth","Jones","Labour",3500,175,"Same MP","Ruth Jones",null,"Not Manufacturing Dependent",6.7796610169491522,6.8,6.8,125,{"$f":"VLOOKUP(B399,'2022emp'!$A$2:$B$633,2,FALSE)","v":3500},{"$f":"VLOOKUP(B399,'2022emp'!$A$2:$F$633,4,FALSE)","v":52000},{"$f":"VLOOKUP(B399,'2022emp'!$A$2:$H$633,7,FALSE)","v":3500},{"$f":"VLOOKUP(B399,'2022emp'!$A$2:$H$633,8,FALSE)","v":300},0,6.7307692307692308,"Not Manufacturing Dependent",6.7]
["Northern Ireland","Newry & Armagh",null,null,{"$error":"#DIV/0!"},375,335,345,30,40,"Mickey","Brady","Sinn Fein","Hold","Mickey","Brady","Sinn Fein",null,null,"Same MP","Mickey Brady",null,{"$error":"#DIV/0!"},11.441534522258658,11.4,11.4,385,{"$f":"VLOOKUP(B400,'2022emp'!$A$2:$B$633,2,FALSE)","v":{"$error":"#N/A"}},{"$f":"VLOOKUP(B400,'2022emp'!$A$2:$F$633,4,FALSE)","v":{"$error":"#N/A"}},{"$f":"VLOOKUP(B400,'2022emp'!$A$2:$H$633,7,FALSE)","v":{"$error":"#N/A"}},{"$f":"VLOOKUP(B400,'2022emp'!$A$2:$H$633,8,FALSE)","v":{"$error":"#N/A"}},50,null,"Not Manufacturing Dependent",0]
["South West","Newton Abbot",2500,30000,8.3333333333333321,225,200,205,20,25,"Anne Marie","Morris","Conservative","Hold","Anne Marie","Morris","Conservative",2250,200,"Same MP","Anne Marie Morris",null,"Manufacturing Dependent",8.3333333333333321,8.3000000000000007,8.3000000000000007,215,{"$f":"VLOOKUP(B401,'2022emp'!$A$2:$B$633,2,FALSE)","v":2500},{"$f":"VLOOKUP(B401,'2022emp'!$A$2:$F$633,4,FALSE)","v":31000},{"$f":"VLOOKUP(B401,'2022emp'!$A$2:$H$633,7,FALSE)","v":2250},{"$f":"VLOOKUP(B401,'2022emp'!$A$2:$H$633,8,FALSE)","v":300},15,8.064516129032258,"Not Manufacturing Dependent",8.1]
["Yorkshire & the Humber","Normanton, Pontefract and Castleford",9000,52000,17.307692307692307,245,225,225,20,20,"Yvette","Cooper","Labour","Hold","Yvette","Cooper","Labour",9000,800,"Same MP","Yvette Cooper",null,"Very Manufacturing Dependent",18.518518518518519,18.5,18.5,250,{"$f":"VLOOKUP(B402,'2022emp'!$A$2:$B$633,2,FALSE)","v":11000},{"$f":"VLOOKUP(B402,'2022emp'!$A$2:$F$633,4,FALSE)","v":55000},{"$f":"VLOOKUP(B402,'2022emp'!$A$2:$H$633,7,FALSE)","v":10000},{"$f":"VLOOKUP(B402,'2022emp'!$A$2:$H$633,8,FALSE)","v":800},25,20,"Very Manufacturing Dependent",20]
["Northern Ireland","North Antrim",null,null,{"$error":"#DIV/0!"},260,265,265,-5,-5,"Ian","Paisley Jnr","DUP","Hold","Ian","Paisley Jnr","DUP",null,null,"Same MP","Ian Paisley Jnr",null,{"$error":"#DIV/0!"},17.508727831308477,17.5,17.5,290,{"$f":"VLOOKUP(B403,'2022emp'!$A$2:$B$633,2,FALSE)","v":{"$error":"#N/A"}},{"$f":"VLOOKUP(B403,'2022emp'!$A$2:$F$633,4,FALSE)","v":{"$error":"#N/A"}},{"$f":"VLOOKUP(B403,'2022emp'!$A$2:$H$633,7,FALSE)","v":{"$error":"#N/A"}},{"$f":"VLOOKUP(B403,'2022emp'!$A$2:$H$633,8,FALSE)","v":{"$error":"#N/A"}},25,null,"Not Manufacturing Dependent",0]
["Scotland","North Ayrshire and Arran",2250,21000,10.714285714285714,150,150,155,-5,0,"Patricia","Gibson","Scottish National Party","Hold","Patricia","Gibson","Scottish National Party",2250,175,"Same MP","Patricia Gibson",null,"Manufacturing Dependent",9.7826086956521738,9.8000000000000007,9.8000000000000007,145,{"$f":"VLOOKUP(B404,'2022emp'!$A$2:$B$633,2,FALSE)","v":2500},{"$f":"VLOOKUP(B404,'2022emp'!$A$2:$F$633,4,FALSE)","v":23000},{"$f":"VLOOKUP(B404,'2022emp'!$A$2:$H$633,7,FALSE)","v":2250},{"$f":"VLOOKUP(B404,'2022emp'!$A$2:$H$633,8,FALSE)","v":225},-5,10.869565217391305,"Manufacturing Dependent",10.9]
["South West","North Cornwall",3000,33000,9.0909090909090917,275,230,255,20,45,"Scott","Mann","Conservative","Hold","Scott","Mann","Conservative",2500,200,"Same MP","Scott Mann",null,"Manufacturing Dependent",10,10,10,275,{"$f":"VLOOKUP(B405,'2022emp'!$A$2:$B$633,2,FALSE)","v":3500},{"$f":"VLOOKUP(B405,'2022emp'!$A$2:$F$633,4,FALSE)","v":37000},{"$f":"VLOOKUP(B405,'2022emp'!$A$2:$H$633,7,FALSE)","v":3000},{"$f":"VLOOKUP(B405,'2022emp'!$A$2:$H$633,8,FALSE)","v":400},45,9.4594594594594597,"Manufacturing Dependent",9.5]
["South West","North Devon",6000,41000,14.634146341463413,225,220,215,10,5,"Selaine","Saxby","Conservative","Hold","Selaine","Saxby","Conservative",5000,400,"Same MP","Selaine Saxby",null,"Manufacturing Dependent",11.904761904761903,11.9,11.9,230,{"$f":"VLOOKUP(B406,'2022emp'!$A$2:$B$633,2,FALSE)","v":6000},{"$f":"VLOOKUP(B406,'2022emp'!$A$2:$F$633,4,FALSE)","v":42000},{"$f":"VLOOKUP(B406,'2022emp'!$A$2:$H$633,7,FALSE)","v":5000},{"$f":"VLOOKUP(B406,'2022emp'!$A$2:$H$633,8,FALSE)","v":450},10,14.285714285714285,"Manufacturing Dependent",14.3]
["South West","North Dorset",3500,32000,10.9375,370,350,370,0,20,"Simon","Hoare","Conservative","Hold","Simon","Hoare","Conservative",3500,450,"Same MP","Simon Hoare",null,"Manufacturing Dependent",12.5,12.5,12.5,370,{"$f":"VLOOKUP(B407,'2022emp'!$A$2:$B$633,2,FALSE)","v":4000},{"$f":"VLOOKUP(B407,'2022emp'!$A$2:$F$633,4,FALSE)","v":33000},{"$f":"VLOOKUP(B407,'2022emp'!$A$2:$H$633,7,FALSE)","v":4000},{"$f":"VLOOKUP(B407,'2022emp'!$A$2:$H$633,8,FALSE)","v":400},20,12.121212121212121,"Manufacturing Dependent",12.1]
["Northern Ireland","North Down",null,null,{"$error":"#DIV/0!"},130,130,125,5,0,"Stephen","Farry","Alliance","Hold","Stephen","Farry","Alliance",null,null,"Same MP","Stephen Farry",null,{"$error":"#DIV/0!"},5.4601361739512413,5.5,5.5,115,{"$f":"VLOOKUP(B408,'2022emp'!$A$2:$B$633,2,FALSE)","v":{"$error":"#N/A"}},{"$f":"VLOOKUP(B408,'2022emp'!$A$2:$F$633,4,FALSE)","v":{"$error":"#N/A"}},{"$f":"VLOOKUP(B408,'2022emp'!$A$2:$H$633,7,FALSE)","v":{"$error":"#N/A"}},{"$f":"VLOOKUP(B408,'2022emp'!$A$2:$H$633,8,FALSE)","v":{"$error":"#N/A"}},-15,null,"Not Manufacturing Dependent",0]
["North East","North Durham",2000,21000,9.5238095238095237,130,120,125,5,10,"Kevan","Jones","Labour","Hold","Kevan","Jones","Labour",1750,75,"Same MP","Kevan Jones",null,"Manufacturing Dependent",9.5238095238095237,9.5,9.5,140,{"$f":"VLOOKUP(B409,'2022emp'!$A$2:$B$633,2,FALSE)","v":1750},{"$f":"VLOOKUP(B409,'2022emp'!$A$2:$F$633,4,FALSE)","v":25000},{"$f":"VLOOKUP(B409,'2022emp'!$A$2:$H$633,7,FALSE)","v":1750},{"$f":"VLOOKUP(B409,'2022emp'!$A$2:$H$633,8,FALSE)","v":150},20,7.0000000000000009,"Not Manufacturing Dependent",7]
["Eastern","North East Bedfordshire",2500,33000,7.5757575757575761,290,270,275,15,20,"Richard","Fuller","Conservative","Hold","Richard","Fuller","Conservative",2500,250,"Same MP","Richard Fuller",null,"Not Manufacturing Dependent",9.0909090909090917,9.1,9.1,260,{"$f":"VLOOKUP(B410,'2022emp'!$A$2:$B$633,2,FALSE)","v":3000},{"$f":"VLOOKUP(B410,'2022emp'!$A$2:$F$633,4,FALSE)","v":36000},{"$f":"VLOOKUP(B410,'2022emp'!$A$2:$H$633,7,FALSE)","v":2500},{"$f":"VLOOKUP(B410,'2022emp'!$A$2:$H$633,8,FALSE)","v":250},-10,8.3333333333333321,"Not Manufacturing Dependent",8.3000000000000007]
["Eastern","North East Cambridgeshire",6000,40000,15,280,275,275,5,5,"Steve","Barclay","Conservative","Hold","Stephen","Barclay","Conservative",6000,500,"Same MP","Steve Barclay",null,"Manufacturing Dependent",18.421052631578945,18.399999999999999,18.399999999999999,290,{"$f":"VLOOKUP(B411,'2022emp'!$A$2:$B$633,2,FALSE)","v":7000},{"$f":"VLOOKUP(B411,'2022emp'!$A$2:$F$633,4,FALSE)","v":41000},{"$f":"VLOOKUP(B411,'2022emp'!$A$2:$H$633,7,FALSE)","v":6000},{"$f":"VLOOKUP(B411,'2022emp'!$A$2:$H$633,8,FALSE)","v":500},15,17.073170731707318,"Manufacturing Dependent",17.100000000000001]
["East Midlands","North East Derbyshire",5000,25000,20,225,210,220,5,15,"Lee","Rowley","Conservative","Hold","Lee","Rowley","Conservative",4500,500,"Same MP","Lee Rowley",null,"Very Manufacturing Dependent",20,20,20,230,{"$f":"VLOOKUP(B412,'2022emp'!$A$2:$B$633,2,FALSE)","v":4000},{"$f":"VLOOKUP(B412,'2022emp'!$A$2:$F$633,4,FALSE)","v":27000},{"$f":"VLOOKUP(B412,'2022emp'!$A$2:$H$633,7,FALSE)","v":3500},{"$f":"VLOOKUP(B412,'2022emp'!$A$2:$H$633,8,FALSE)","v":300},20,14.814814814814813,"Manufacturing Dependent",14.8]
["Scotland","North East Fife",1250,25000,5,135,125,130,5,10,"Wendy","Chamberlain","Liberal Democrat","Hold","Wendy","Chamberlain","Liberal Democrat",1000,150,"Same MP","Wendy Chamberlain",null,"Not Manufacturing Dependent",4.6296296296296298,4.5999999999999996,4.5999999999999996,140,{"$f":"VLOOKUP(B413,'2022emp'!$A$2:$B$633,2,FALSE)","v":1250},{"$f":"VLOOKUP(B413,'2022emp'!$A$2:$F$633,4,FALSE)","v":27000},{"$f":"VLOOKUP(B413,'2022emp'!$A$2:$H$633,7,FALSE)","v":1250},{"$f":"VLOOKUP(B413,'2022emp'!$A$2:$H$633,8,FALSE)","v":150},15,4.6296296296296298,"Not Manufacturing Dependent",4.5999999999999996]
["South East","North East Hampshire",1750,34000,5.1470588235294112,220,210,215,5,10,"Ranil","Jayawardena","Conservative","Hold","Ranil","Jayawardena","Conservative",1500,175,"Same MP","Ranil Jayawardena",null,"Not Manufacturing Dependent",4.7297297297297298,4.7,4.7,210,{"$f":"VLOOKUP(B414,'2022emp'!$A$2:$B$633,2,FALSE)","v":1750},{"$f":"VLOOKUP(B414,'2022emp'!$A$2:$F$633,4,FALSE)","v":36000},{"$f":"VLOOKUP(B414,'2022emp'!$A$2:$H$633,7,FALSE)","v":1750},{"$f":"VLOOKUP(B414,'2022emp'!$A$2:$H$633,8,FALSE)","v":225},0,4.8611111111111116,"Not Manufacturing Dependent",4.9000000000000004]
["Eastern","North East Hertfordshire",6000,40000,15,350,330,330,20,20,"Oliver","Heald","Conservative","Hold","Oliver","Heald","Conservative",5000,450,"Same MP","Oliver Heald",null,"Manufacturing Dependent",15.384615384615385,15.4,15.4,360,{"$f":"VLOOKUP(B415,'2022emp'!$A$2:$B$633,2,FALSE)","v":6000},{"$f":"VLOOKUP(B415,'2022emp'!$A$2:$F$633,4,FALSE)","v":40000},{"$f":"VLOOKUP(B415,'2022emp'!$A$2:$H$633,7,FALSE)","v":5000},{"$f":"VLOOKUP(B415,'2022emp'!$A$2:$H$633,8,FALSE)","v":600},30,15,"Manufacturing Dependent",15]
["South West","North East Somerset",2250,31000,7.2580645161290329,230,220,215,15,10,"Jacob","Rees-Mogg","Conservative","Hold","Jacob","Rees-Mogg","Conservative",2000,200,"Same MP","Jacob Rees-Mogg",null,"Not Manufacturing Dependent",7.5,7.5,7.5,230,{"$f":"VLOOKUP(B416,'2022emp'!$A$2:$B$633,2,FALSE)","v":2500},{"$f":"VLOOKUP(B416,'2022emp'!$A$2:$F$633,4,FALSE)","v":32000},{"$f":"VLOOKUP(B416,'2022emp'!$A$2:$H$633,7,FALSE)","v":2250},{"$f":"VLOOKUP(B416,'2022emp'!$A$2:$H$633,8,FALSE)","v":400},10,7.8125,"Not Manufacturing Dependent",7.8]
["West Midlands","North Herefordshire",4000,27000,14.814814814814813,345,320,310,35,25,"Bill","Wiggin","Conservative","Hold","Bill","Wiggin","Conservative",3500,350,"Same MP","Bill Wiggin",null,"Manufacturing Dependent",14.814814814814813,14.8,14.8,330,{"$f":"VLOOKUP(B417,'2022emp'!$A$2:$B$633,2,FALSE)","v":4500},{"$f":"VLOOKUP(B417,'2022emp'!$A$2:$F$633,4,FALSE)","v":29000},{"$f":"VLOOKUP(B417,'2022emp'!$A$2:$H$633,7,FALSE)","v":4000},{"$f":"VLOOKUP(B417,'2022emp'!$A$2:$H$633,8,FALSE)","v":600},10,15.517241379310345,"Manufacturing Dependent",15.5]
["Eastern","North Norfolk",1750,25000,7.0000000000000009,175,180,180,-5,-5,"Duncan","Baker","Conservative","Hold","Duncan Charles","Baker","Conservative",1500,175,"Same MP","Duncan Baker",null,"Not Manufacturing Dependent",6,6,6,175,{"$f":"VLOOKUP(B418,'2022emp'!$A$2:$B$633,2,FALSE)","v":1750},{"$f":"VLOOKUP(B418,'2022emp'!$A$2:$F$633,4,FALSE)","v":26000},{"$f":"VLOOKUP(B418,'2022emp'!$A$2:$H$633,7,FALSE)","v":1500},{"$f":"VLOOKUP(B418,'2022emp'!$A$2:$H$633,8,FALSE)","v":225},-5,6.7307692307692308,"Not Manufacturing Dependent",6.7]
["West Midlands","North Shropshire",4500,37000,12.162162162162163,295,285,285,10,10,"Helen","Morgan","Liberal Democrat","Change","Owen","Paterson","Conservative",4000,700,"New MP","Helen Morgan",null,"Manufacturing Dependent",13.157894736842104,13.2,13.2,305,{"$f":"VLOOKUP(B419,'2022emp'!$A$2:$B$633,2,FALSE)","v":6000},{"$f":"VLOOKUP(B419,'2022emp'!$A$2:$F$633,4,FALSE)","v":40000},{"$f":"VLOOKUP(B419,'2022emp'!$A$2:$H$633,7,FALSE)","v":5000},{"$f":"VLOOKUP(B419,'2022emp'!$A$2:$H$633,8,FALSE)","v":800},20,15,"Manufacturing Dependent",15]
["South West","North Somerset",3500,45000,7.7777777777777777,225,235,225,0,-10,"Liam","Fox","Conservative","Hold","Liam","Fox","Conservative",3500,300,"Same MP","Liam Fox",null,"Not Manufacturing Dependent",9.0909090909090917,9.1,9.1,220,{"$f":"VLOOKUP(B420,'2022emp'!$A$2:$B$633,2,FALSE)","v":4500},{"$f":"VLOOKUP(B420,'2022emp'!$A$2:$F$633,4,FALSE)","v":48000},{"$f":"VLOOKUP(B420,'2022emp'!$A$2:$H$633,7,FALSE)","v":4000},{"$f":"VLOOKUP(B420,'2022emp'!$A$2:$H$633,8,FALSE)","v":350},-15,9.375,"Manufacturing Dependent",9.4]
["South West","North Swindon",7000,51000,13.725490196078432,185,175,185,0,10,"Justin","Tomlinson","Conservative","Hold","Justin","Tomlinson","Conservative",7000,225,"Same MP","Justin Tomlinson",null,"Manufacturing Dependent",13.461538461538462,13.5,13.5,180,{"$f":"VLOOKUP(B421,'2022emp'!$A$2:$B$633,2,FALSE)","v":4000},{"$f":"VLOOKUP(B421,'2022emp'!$A$2:$F$633,4,FALSE)","v":51000},{"$f":"VLOOKUP(B421,'2022emp'!$A$2:$H$633,7,FALSE)","v":3500},{"$f":"VLOOKUP(B421,'2022emp'!$A$2:$H$633,8,FALSE)","v":350},5,7.8431372549019605,"Not Manufacturing Dependent",7.8]
["South East","North Thanet",1750,28000,6.25,190,160,170,20,30,"Roger","Gale","Conservative","Hold","Roger","Gale","Conservative",1500,225,"Same MP","Roger Gale",null,"Not Manufacturing Dependent",6.7307692307692308,6.7,6.7,195,{"$f":"VLOOKUP(B422,'2022emp'!$A$2:$B$633,2,FALSE)","v":1500},{"$f":"VLOOKUP(B422,'2022emp'!$A$2:$F$633,4,FALSE)","v":29000},{"$f":"VLOOKUP(B422,'2022emp'!$A$2:$H$633,7,FALSE)","v":1250},{"$f":"VLOOKUP(B422,'2022emp'!$A$2:$H$633,8,FALSE)","v":175},35,5.1724137931034484,"Not Manufacturing Dependent",5.2]
["North East","North Tyneside",4500,42000,10.714285714285714,180,165,170,10,15,"Mary","Glindon","Labour","Hold","Mary","Glindon","Labour",4000,250,"Same MP","Mary Glindon",null,"Manufacturing Dependent",10.714285714285714,10.7,10.7,155,{"$f":"VLOOKUP(B423,'2022emp'!$A$2:$B$633,2,FALSE)","v":4500},{"$f":"VLOOKUP(B423,'2022emp'!$A$2:$F$633,4,FALSE)","v":44000},{"$f":"VLOOKUP(B423,'2022emp'!$A$2:$H$633,7,FALSE)","v":4000},{"$f":"VLOOKUP(B423,'2022emp'!$A$2:$H$633,8,FALSE)","v":500},-10,10.227272727272728,"Manufacturing Dependent",10.199999999999999]
["West Midlands","North Warwickshire",9000,57000,15.789473684210526,320,340,340,-20,-20,"Craig","Tracey","Conservative","Hold","Craig","Tracey","Conservative",8000,500,"Same MP","Craig Tracey",null,"Manufacturing Dependent",17.1875,17.2,17.2,290,{"$f":"VLOOKUP(B424,'2022emp'!$A$2:$B$633,2,FALSE)","v":9000},{"$f":"VLOOKUP(B424,'2022emp'!$A$2:$F$633,4,FALSE)","v":63000},{"$f":"VLOOKUP(B424,'2022emp'!$A$2:$H$633,7,FALSE)","v":8000},{"$f":"VLOOKUP(B424,'2022emp'!$A$2:$H$633,8,FALSE)","v":1250},-50,14.285714285714285,"Manufacturing Dependent",14.3]
["Eastern","North West Cambridgeshire",4500,60000,7.5,345,320,320,25,25,"Shailesh","Vara","Conservative","Hold","Shailesh","Vara","Conservative",3500,600,"Same MP","Shailesh Vara",null,"Not Manufacturing Dependent",6.666666666666667,6.7,6.7,350,{"$f":"VLOOKUP(B425,'2022emp'!$A$2:$B$633,2,FALSE)","v":4500},{"$f":"VLOOKUP(B425,'2022emp'!$A$2:$F$633,4,FALSE)","v":61000},{"$f":"VLOOKUP(B425,'2022emp'!$A$2:$H$633,7,FALSE)","v":4000},{"$f":"VLOOKUP(B425,'2022emp'!$A$2:$H$633,8,FALSE)","v":400},30,7.3770491803278686,"Not Manufacturing Dependent",7.4]
["North East","North West Durham",3500,22000,15.909090909090908,165,165,150,15,0,"Richard","Holden","Conservative","Hold","Richard","Holden","Conservative",3500,175,"Same MP","Richard Holden",null,"Manufacturing Dependent",20.454545454545457,20.5,20.5,155,{"$f":"VLOOKUP(B426,'2022emp'!$A$2:$B$633,2,FALSE)","v":4000},{"$f":"VLOOKUP(B426,'2022emp'!$A$2:$F$633,4,FALSE)","v":23000},{"$f":"VLOOKUP(B426,'2022emp'!$A$2:$H$633,7,FALSE)","v":3500},{"$f":"VLOOKUP(B426,'2022emp'!$A$2:$H$633,8,FALSE)","v":600},-10,17.391304347826086,"Manufacturing Dependent",17.399999999999999]
["South East","North West Hampshire",5000,41000,12.195121951219512,260,295,285,-25,-35,"Kit","Malthouse","Conservative","Hold","Kit","Malthouse","Conservative",4500,600,"Same MP","Kit Malthouse",null,"Manufacturing Dependent",11.904761904761903,11.9,11.9,270,{"$f":"VLOOKUP(B427,'2022emp'!$A$2:$B$633,2,FALSE)","v":5000},{"$f":"VLOOKUP(B427,'2022emp'!$A$2:$F$633,4,FALSE)","v":43000},{"$f":"VLOOKUP(B427,'2022emp'!$A$2:$H$633,7,FALSE)","v":4500},{"$f":"VLOOKUP(B427,'2022emp'!$A$2:$H$633,8,FALSE)","v":700},-25,11.627906976744185,"Manufacturing Dependent",11.6]
["East Midlands","North West Leicestershire",8000,66000,12.121212121212121,305,310,325,-20,-5,"Andrew","Bridgen","Reclaim","Change","Andrew","Bridgen","Conservative",7000,600,"Same MP","Andrew Bridgen",null,"Manufacturing Dependent",13.114754098360656,13.1,13.1,285,{"$f":"VLOOKUP(B428,'2022emp'!$A$2:$B$633,2,FALSE)","v":7000},{"$f":"VLOOKUP(B428,'2022emp'!$A$2:$F$633,4,FALSE)","v":71000},{"$f":"VLOOKUP(B428,'2022emp'!$A$2:$H$633,7,FALSE)","v":7000},{"$f":"VLOOKUP(B428,'2022emp'!$A$2:$H$633,8,FALSE)","v":500},-25,9.8591549295774641,"Manufacturing Dependent",9.9]
["Eastern","North West Norfolk",4500,42000,10.714285714285714,200,220,215,-15,-20,"James","Wild","Conservative","Hold","James","Wild","Conservative",4500,350,"Same MP","James Wild",null,"Manufacturing Dependent",12.195121951219512,12.2,12.2,215,{"$f":"VLOOKUP(B429,'2022emp'!$A$2:$B$633,2,FALSE)","v":5000},{"$f":"VLOOKUP(B429,'2022emp'!$A$2:$F$633,4,FALSE)","v":45000},{"$f":"VLOOKUP(B429,'2022emp'!$A$2:$H$633,7,FALSE)","v":5000},{"$f":"VLOOKUP(B429,'2022emp'!$A$2:$H$633,8,FALSE)","v":350},-5,11.111111111111111,"Manufacturing Dependent",11.1]
["South West","North Wiltshire",2500,33000,7.5757575757575761,235,240,240,-5,-5,"James","Gray","Conservative","Hold","James","Gray","Conservative",2250,250,"Same MP","James Gray",null,"Not Manufacturing Dependent",7.1428571428571423,7.1,7.1,250,{"$f":"VLOOKUP(B430,'2022emp'!$A$2:$B$633,2,FALSE)","v":2500},{"$f":"VLOOKUP(B430,'2022emp'!$A$2:$F$633,4,FALSE)","v":35000},{"$f":"VLOOKUP(B430,'2022emp'!$A$2:$H$633,7,FALSE)","v":2500},{"$f":"VLOOKUP(B430,'2022emp'!$A$2:$H$633,8,FALSE)","v":250},10,7.1428571428571423,"Not Manufacturing Dependent",7.1]
["East Midlands","Northampton North",4500,37000,12.162162162162163,175,160,160,15,15,"Michael","Ellis","Conservative","Hold","Michael","Ellis","Conservative",4000,500,"Same MP","Michael Ellis",null,"Manufacturing Dependent",14.285714285714285,14.3,14.3,165,{"$f":"VLOOKUP(B431,'2022emp'!$A$2:$B$633,2,FALSE)","v":4000},{"$f":"VLOOKUP(B431,'2022emp'!$A$2:$F$633,4,FALSE)","v":32000},{"$f":"VLOOKUP(B431,'2022emp'!$A$2:$H$633,7,FALSE)","v":3000},{"$f":"VLOOKUP(B431,'2022emp'!$A$2:$H$633,8,FALSE)","v":1250},5,12.5,"Manufacturing Dependent",12.5]
["East Midlands","Northampton South",3500,62000,5.6451612903225801,210,195,190,20,15,"Andrew","Lewer","Conservative","Hold","Andrew","Lewer","Conservative",3000,350,"Same MP","Andrew Lewer",null,"Not Manufacturing Dependent",6.0606060606060606,6.1,6.1,195,{"$f":"VLOOKUP(B432,'2022emp'!$A$2:$B$633,2,FALSE)","v":3500},{"$f":"VLOOKUP(B432,'2022emp'!$A$2:$F$633,4,FALSE)","v":72000},{"$f":"VLOOKUP(B432,'2022emp'!$A$2:$H$633,7,FALSE)","v":3500},{"$f":"VLOOKUP(B432,'2022emp'!$A$2:$H$633,8,FALSE)","v":300},0,4.8611111111111116,"Not Manufacturing Dependent",4.9000000000000004]
["Eastern","Norwich North",3000,41000,7.3170731707317067,160,170,160,0,-10,"Chloe","Smith","Conservative","Hold","Chloe","Smith","Conservative",3000,250,"Same MP","Chloe Smith",null,"Not Manufacturing Dependent",8.3333333333333321,8.3000000000000007,8.3000000000000007,165,{"$f":"VLOOKUP(B433,'2022emp'!$A$2:$B$633,2,FALSE)","v":3500},{"$f":"VLOOKUP(B433,'2022emp'!$A$2:$F$633,4,FALSE)","v":41000},{"$f":"VLOOKUP(B433,'2022emp'!$A$2:$H$633,7,FALSE)","v":3500},{"$f":"VLOOKUP(B433,'2022emp'!$A$2:$H$633,8,FALSE)","v":350},-5,8.536585365853659,"Not Manufacturing Dependent",8.5]
["Eastern","Norwich South",2000,67000,2.9850746268656714,130,125,135,-5,5,"Clive","Lewis","Labour","Hold","Clive","Lewis","Labour",1750,250,"Same MP","Clive Lewis",null,"Not Manufacturing Dependent",3.3333333333333335,3.3,3.3,135,{"$f":"VLOOKUP(B434,'2022emp'!$A$2:$B$633,2,FALSE)","v":2250},{"$f":"VLOOKUP(B434,'2022emp'!$A$2:$F$633,4,FALSE)","v":68000},{"$f":"VLOOKUP(B434,'2022emp'!$A$2:$H$633,7,FALSE)","v":2000},{"$f":"VLOOKUP(B434,'2022emp'!$A$2:$H$633,8,FALSE)","v":225},10,3.3088235294117649,"Not Manufacturing Dependent",3.3]
["East Midlands","Nottingham East",1250,58000,2.1551724137931036,180,190,185,-5,-10,"Nadia","Whittome","Labour","Hold","Nadia","Whittome","Labour",1000,150,"Same MP","Nadia Whittome",null,"Not Manufacturing Dependent",2.5862068965517242,2.6,2.6,180,{"$f":"VLOOKUP(B435,'2022emp'!$A$2:$B$633,2,FALSE)","v":1500},{"$f":"VLOOKUP(B435,'2022emp'!$A$2:$F$633,4,FALSE)","v":63000},{"$f":"VLOOKUP(B435,'2022emp'!$A$2:$H$633,7,FALSE)","v":1250},{"$f":"VLOOKUP(B435,'2022emp'!$A$2:$H$633,8,FALSE)","v":225},-10,2.3809523809523809,"Not Manufacturing Dependent",2.4]
["East Midlands","Nottingham North",2000,24000,8.3333333333333321,165,180,235,-70,-15,"Alex","Norris","Labour/Co-operative","Hold","Alex","Norris","Labour/Co-operative",1750,175,"Same MP","Alex Norris",null,"Manufacturing Dependent",10,10,10,170,{"$f":"VLOOKUP(B436,'2022emp'!$A$2:$B$633,2,FALSE)","v":2250},{"$f":"VLOOKUP(B436,'2022emp'!$A$2:$F$633,4,FALSE)","v":28000},{"$f":"VLOOKUP(B436,'2022emp'!$A$2:$H$633,7,FALSE)","v":2000},{"$f":"VLOOKUP(B436,'2022emp'!$A$2:$H$633,8,FALSE)","v":250},-10,8.0357142857142865,"Not Manufacturing Dependent",8]
["East Midlands","Nottingham South",6000,112000,5.3571428571428568,200,215,220,-20,-15,"Lilian","Greenwood","Labour","Hold","Lilian","Greenwood","Labour",5000,500,"Same MP","Lilian Greenwood",null,"Not Manufacturing Dependent",4.4642857142857144,4.5,4.5,200,{"$f":"VLOOKUP(B437,'2022emp'!$A$2:$B$633,2,FALSE)","v":6000},{"$f":"VLOOKUP(B437,'2022emp'!$A$2:$F$633,4,FALSE)","v":116000},{"$f":"VLOOKUP(B437,'2022emp'!$A$2:$H$633,7,FALSE)","v":6000},{"$f":"VLOOKUP(B437,'2022emp'!$A$2:$H$633,8,FALSE)","v":500},-15,5.1724137931034484,"Not Manufacturing Dependent",5.2]
["West Midlands","Nuneaton",2250,31000,7.2580645161290329,230,215,210,20,15,"Marcus","Jones","Conservative","Hold","Marcus","Jones","Conservative",2000,225,"Same MP","Marcus Jones",null,"Not Manufacturing Dependent",7.8125,7.8,7.8,215,{"$f":"VLOOKUP(B438,'2022emp'!$A$2:$B$633,2,FALSE)","v":2500},{"$f":"VLOOKUP(B438,'2022emp'!$A$2:$F$633,4,FALSE)","v":32000},{"$f":"VLOOKUP(B438,'2022emp'!$A$2:$H$633,7,FALSE)","v":2250},{"$f":"VLOOKUP(B438,'2022emp'!$A$2:$H$633,8,FALSE)","v":350},0,7.8125,"Not Manufacturing Dependent",7.8]
["Scotland","Ochil and South Perthshire",3000,29000,10.344827586206897,180,185,175,5,-5,"John","Nicolson","Scottish National Party","Hold","John","Nicolson","Scottish National Party",3000,200,"Same MP","John Nicolson",null,"Manufacturing Dependent",11.666666666666666,11.7,11.7,180,{"$f":"VLOOKUP(B439,'2022emp'!$A$2:$B$633,2,FALSE)","v":3000},{"$f":"VLOOKUP(B439,'2022emp'!$A$2:$F$633,4,FALSE)","v":31000},{"$f":"VLOOKUP(B439,'2022emp'!$A$2:$H$633,7,FALSE)","v":3000},{"$f":"VLOOKUP(B439,'2022emp'!$A$2:$H$633,8,FALSE)","v":250},-5,9.67741935483871,"Manufacturing Dependent",9.6999999999999993]
["Wales","Ogmore",3500,19000,18.421052631578945,120,115,120,0,5,"Chris","Elmore","Labour","Hold","Chris","Elmore","Labour",3500,225,"Same MP","Chris Elmore",null,"Very Manufacturing Dependent",20,20,20,125,{"$f":"VLOOKUP(B440,'2022emp'!$A$2:$B$633,2,FALSE)","v":4500},{"$f":"VLOOKUP(B440,'2022emp'!$A$2:$F$633,4,FALSE)","v":22000},{"$f":"VLOOKUP(B440,'2022emp'!$A$2:$H$633,7,FALSE)","v":4500},{"$f":"VLOOKUP(B440,'2022emp'!$A$2:$H$633,8,FALSE)","v":250},10,20.454545454545457,"Very Manufacturing Dependent",20.5]
["London","Old Bexley and Sidcup",1000,25000,4,105,115,115,-10,-10,"Louie","French","Conservative","Hold","James","Brokenshire","Conservative",900,100,"New MP","Louie French",null,"Not Manufacturing Dependent",3.4615384615384617,3.5,3.5,105,{"$f":"VLOOKUP(B441,'2022emp'!$A$2:$B$633,2,FALSE)","v":1000},{"$f":"VLOOKUP(B441,'2022emp'!$A$2:$F$633,4,FALSE)","v":25000},{"$f":"VLOOKUP(B441,'2022emp'!$A$2:$H$633,7,FALSE)","v":900},{"$f":"VLOOKUP(B441,'2022emp'!$A$2:$H$633,8,FALSE)","v":75},-10,4,"Not Manufacturing Dependent",4]
["North West","Oldham East and Saddleworth",5000,32000,15.625,265,260,260,5,5,"Debbie","Abrahams","Labour","Hold","Debbie","Abrahams","Labour",4500,500,"Same MP","Debbie Abrahams",null,"Manufacturing Dependent",12.857142857142856,12.9,12.9,285,{"$f":"VLOOKUP(B442,'2022emp'!$A$2:$B$633,2,FALSE)","v":5000},{"$f":"VLOOKUP(B442,'2022emp'!$A$2:$F$633,4,FALSE)","v":33000},{"$f":"VLOOKUP(B442,'2022emp'!$A$2:$H$633,7,FALSE)","v":4500},{"$f":"VLOOKUP(B442,'2022emp'!$A$2:$H$633,8,FALSE)","v":500},25,15.151515151515152,"Manufacturing Dependent",15.2]
["North West","Oldham West and Royton",5000,41000,12.195121951219512,245,245,245,0,0,"Jim","McMahon","Labour/Co-operative","Hold","Jim","McMahon","Labour/Co-operative",4500,500,"Same MP","Jim McMahon",null,"Manufacturing Dependent",14.285714285714285,14.3,14.3,250,{"$f":"VLOOKUP(B443,'2022emp'!$A$2:$B$633,2,FALSE)","v":5000},{"$f":"VLOOKUP(B443,'2022emp'!$A$2:$F$633,4,FALSE)","v":50000},{"$f":"VLOOKUP(B443,'2022emp'!$A$2:$H$633,7,FALSE)","v":5000},{"$f":"VLOOKUP(B443,'2022emp'!$A$2:$H$633,8,FALSE)","v":350},5,10,"Manufacturing Dependent",10]
["Scotland","Orkney and Shetland",1500,24000,6.25,130,130,130,0,0,"Alistair","Carmichael","Liberal Democrat","Hold","Alistair","Carmichael","Liberal Democrat",1250,300,"Same MP","Alistair Carmichael",null,"Not Manufacturing Dependent",5.2083333333333339,5.2,5.2,155,{"$f":"VLOOKUP(B444,'2022emp'!$A$2:$B$633,2,FALSE)","v":1250},{"$f":"VLOOKUP(B444,'2022emp'!$A$2:$F$633,4,FALSE)","v":24000},{"$f":"VLOOKUP(B444,'2022emp'!$A$2:$H$633,7,FALSE)","v":1000},{"$f":"VLOOKUP(B444,'2022emp'!$A$2:$H$633,8,FALSE)","v":350},25,5.2083333333333339,"Not Manufacturing Dependent",5.2]
["London","Orpington",1250,30000,4.1666666666666661,140,150,140,0,-10,"Gareth","Bacon","Conservative","Hold","Gareth","Bacon","Conservative",1000,125,"Same MP","Gareth Bacon",null,"Not Manufacturing Dependent",3.225806451612903,3.2,3.2,155,{"$f":"VLOOKUP(B445,'2022emp'!$A$2:$B$633,2,FALSE)","v":1250},{"$f":"VLOOKUP(B445,'2022emp'!$A$2:$F$633,4,FALSE)","v":33000},{"$f":"VLOOKUP(B445,'2022emp'!$A$2:$H$633,7,FALSE)","v":1000},{"$f":"VLOOKUP(B445,'2022emp'!$A$2:$H$633,8,FALSE)","v":100},5,3.7878787878787881,"Not Manufacturing Dependent",3.8]
["South East","Oxford East",4000,103000,3.8834951456310676,95,95,95,0,0,"Anneliese","Dodds","Labour/Co-operative","Hold","Anneliese","Dodds","Labour/Co-operative",4000,175,"Same MP","Anneliese Dodds",null,"Not Manufacturing Dependent",4.8543689320388346,4.9000000000000004,4.9000000000000004,95,{"$f":"VLOOKUP(B446,'2022emp'!$A$2:$B$633,2,FALSE)","v":3500},{"$f":"VLOOKUP(B446,'2022emp'!$A$2:$F$633,4,FALSE)","v":103000},{"$f":"VLOOKUP(B446,'2022emp'!$A$2:$H$633,7,FALSE)","v":3500},{"$f":"VLOOKUP(B446,'2022emp'!$A$2:$H$633,8,FALSE)","v":175},0,3.3980582524271843,"Not Manufacturing Dependent",3.4]
["South East","Oxford West and Abingdon",2500,53000,4.716981132075472,165,165,170,-5,0,"Layla","Moran","Liberal Democrat","Hold","Layla","Moran","Liberal Democrat",2500,250,"Same MP","Layla Moran",null,"Not Manufacturing Dependent",4.716981132075472,4.7,4.7,185,{"$f":"VLOOKUP(B447,'2022emp'!$A$2:$B$633,2,FALSE)","v":3000},{"$f":"VLOOKUP(B447,'2022emp'!$A$2:$F$633,4,FALSE)","v":57000},{"$f":"VLOOKUP(B447,'2022emp'!$A$2:$H$633,7,FALSE)","v":2500},{"$f":"VLOOKUP(B447,'2022emp'!$A$2:$H$633,8,FALSE)","v":250},20,5.2631578947368416,"Not Manufacturing Dependent",5.3]
["Scotland","Paisley and Renfrewshire North",7000,55000,12.727272727272727,200,190,205,-5,10,"Gavin","Newlands","Scottish National Party","Hold","Gavin","Newlands","Scottish National Party",6000,700,"Same MP","Gavin Newlands",null,"Manufacturing Dependent",13.793103448275861,13.8,13.8,205,{"$f":"VLOOKUP(B448,'2022emp'!$A$2:$B$633,2,FALSE)","v":7000},{"$f":"VLOOKUP(B448,'2022emp'!$A$2:$F$633,4,FALSE)","v":55000},{"$f":"VLOOKUP(B448,'2022emp'!$A$2:$H$633,7,FALSE)","v":7000},{"$f":"VLOOKUP(B448,'2022emp'!$A$2:$H$633,8,FALSE)","v":450},15,12.727272727272727,"Manufacturing Dependent",12.7]
["Scotland","Paisley and Renfrewshire South",1000,29000,3.4482758620689653,100,110,110,-10,-10,"Mhairi","Black","Scottish National Party","Hold","Mhairi","Black","Scottish National Party",900,100,"Same MP","Mhairi Black",null,"Not Manufacturing Dependent",3.4482758620689653,3.4,3.4,90,{"$f":"VLOOKUP(B449,'2022emp'!$A$2:$B$633,2,FALSE)","v":900},{"$f":"VLOOKUP(B449,'2022emp'!$A$2:$F$633,4,FALSE)","v":29000},{"$f":"VLOOKUP(B449,'2022emp'!$A$2:$H$633,7,FALSE)","v":700},{"$f":"VLOOKUP(B449,'2022emp'!$A$2:$H$633,8,FALSE)","v":125},-20,3.103448275862069,"Not Manufacturing Dependent",3.1]
["North West","Pendle",10000,33000,30.303030303030305,285,290,285,0,-5,"Andrew","Stephenson","Conservative","Hold","Andrew","Stephenson","Conservative",9000,1000,"Same MP","Andrew Stephenson",null,"Extremely Manufacturing Dependent",30.303030303030305,30.3,30.3,275,{"$f":"VLOOKUP(B450,'2022emp'!$A$2:$B$633,2,FALSE)","v":8000},{"$f":"VLOOKUP(B450,'2022emp'!$A$2:$F$633,4,FALSE)","v":31000},{"$f":"VLOOKUP(B450,'2022emp'!$A$2:$H$633,7,FALSE)","v":8000},{"$f":"VLOOKUP(B450,'2022emp'!$A$2:$H$633,8,FALSE)","v":600},-15,25.806451612903224,"Very Manufacturing Dependent",25.8]
["Yorkshire & the Humber","Penistone and Stocksbridge",4500,27000,16.666666666666664,190,195,190,0,-5,"Miriam","Cates","Conservative","Hold","Miriam Joy","Cates","Conservative",4000,350,"Same MP","Miriam Cates",null,"Very Manufacturing Dependent",16.666666666666664,16.7,16.7,190,{"$f":"VLOOKUP(B451,'2022emp'!$A$2:$B$633,2,FALSE)","v":4500},{"$f":"VLOOKUP(B451,'2022emp'!$A$2:$F$633,4,FALSE)","v":30000},{"$f":"VLOOKUP(B451,'2022emp'!$A$2:$H$633,7,FALSE)","v":4000},{"$f":"VLOOKUP(B451,'2022emp'!$A$2:$H$633,8,FALSE)","v":300},-5,15,"Manufacturing Dependent",15]
["North West","Penrith and The Border",4000,39000,10.256410256410255,245,235,230,15,10,"Neil","Hudson","Conservative","Hold","Neil","Hudson","Conservative",3500,500,"Same MP","Neil Hudson",null,"Manufacturing Dependent",8.75,8.8000000000000007,8.8000000000000007,240,{"$f":"VLOOKUP(B452,'2022emp'!$A$2:$B$633,2,FALSE)","v":4000},{"$f":"VLOOKUP(B452,'2022emp'!$A$2:$F$633,4,FALSE)","v":40000},{"$f":"VLOOKUP(B452,'2022emp'!$A$2:$H$633,7,FALSE)","v":3500},{"$f":"VLOOKUP(B452,'2022emp'!$A$2:$H$633,8,FALSE)","v":500},5,10,"Manufacturing Dependent",10]
["Scotland","Perth and North Perthshire",3000,43000,6.9767441860465116,180,170,185,-5,10,"Pete","Wishart","Scottish National Party","Hold","Pete","Wishart","Scottish National Party",2500,250,"Same MP","Pete Wishart",null,"Not Manufacturing Dependent",6.5217391304347823,6.5,6.5,185,{"$f":"VLOOKUP(B453,'2022emp'!$A$2:$B$633,2,FALSE)","v":3000},{"$f":"VLOOKUP(B453,'2022emp'!$A$2:$F$633,4,FALSE)","v":45000},{"$f":"VLOOKUP(B453,'2022emp'!$A$2:$H$633,7,FALSE)","v":2500},{"$f":"VLOOKUP(B453,'2022emp'!$A$2:$H$633,8,FALSE)","v":300},15,6.666666666666667,"Not Manufacturing Dependent",6.7]
["Eastern","Peterborough",5000,68000,7.3529411764705888,200,200,195,5,0,"Paul","Bristow","Conservative","Hold","Paul","Bristow","Conservative",5000,350,"Same MP","Paul Bristow",null,"Not Manufacturing Dependent",8.2191780821917799,8.1999999999999993,8.1999999999999993,195,{"$f":"VLOOKUP(B454,'2022emp'!$A$2:$B$633,2,FALSE)","v":7000},{"$f":"VLOOKUP(B454,'2022emp'!$A$2:$F$633,4,FALSE)","v":72000},{"$f":"VLOOKUP(B454,'2022emp'!$A$2:$H$633,7,FALSE)","v":6000},{"$f":"VLOOKUP(B454,'2022emp'!$A$2:$H$633,8,FALSE)","v":450},-5,9.7222222222222232,"Manufacturing Dependent",9.6999999999999993]
["South West","Plymouth, Moor View",4500,39000,11.538461538461538,95,95,100,-5,0,"Johnny","Mercer","Conservative","Hold","Johnny","Mercer","Conservative",4000,300,"Same MP","Johnny Mercer",null,"Manufacturing Dependent",11.111111111111111,11.1,11.1,100,{"$f":"VLOOKUP(B455,'2022emp'!$A$2:$B$633,2,FALSE)","v":4500},{"$f":"VLOOKUP(B455,'2022emp'!$A$2:$F$633,4,FALSE)","v":40000},{"$f":"VLOOKUP(B455,'2022emp'!$A$2:$H$633,7,FALSE)","v":4000},{"$f":"VLOOKUP(B455,'2022emp'!$A$2:$H$633,8,FALSE)","v":300},5,11.25,"Manufacturing Dependent",11.3]
["South West","Plymouth, Sutton and Devonport",8000,56000,14.285714285714285,125,125,135,-10,0,"Luke","Pollard","Labour/Co-operative","Hold","Luke","Pollard","Labour/Co-operative",8000,350,"Same MP","Luke Pollard",null,"Manufacturing Dependent",12.280701754385964,12.3,12.3,115,{"$f":"VLOOKUP(B456,'2022emp'!$A$2:$B$633,2,FALSE)","v":9000},{"$f":"VLOOKUP(B456,'2022emp'!$A$2:$F$633,4,FALSE)","v":60000},{"$f":"VLOOKUP(B456,'2022emp'!$A$2:$H$633,7,FALSE)","v":9000},{"$f":"VLOOKUP(B456,'2022emp'!$A$2:$H$633,8,FALSE)","v":350},-10,15,"Manufacturing Dependent",15]
["Wales","Pontypridd",4500,45000,10,165,125,135,{"$f":"F457-H457","v":30},{"$f":"F457-G457","v":40},"Alex","Davies-Jones","Labour","Hold","Alex","Davies-Jones","Labour",4000,400,"Same MP",{"$f":"CONCATENATE(K457,\" \",L457)","v":"Alex Davies-Jones"},null,{"$f":"IF(E457>24.29, \"Extremely Manufacturing Dependent\", IF(E457>16.59, \"Very Manufacturing Dependent\", IF(E457>8.09, \"Manufacturing Dependent\", \"Not Manufacturing Dependent\")))","v":"Manufacturing Dependent"},11.363636363636363,11.4,11.4,175,{"$f":"VLOOKUP(B457,'2022emp'!$A$2:$B$633,2,FALSE)","v":6000},{"$f":"VLOOKUP(B457,'2022emp'!$A$2:$F$633,4,FALSE)","v":45000},{"$f":"VLOOKUP(B457,'2022emp'!$A$2:$H$633,7,FALSE)","v":5000},{"$f":"VLOOKUP(B457,'2022emp'!$A$2:$H$633,8,FALSE)","v":450},50,13.333333333333334,"Manufacturing Dependent",13.3]
["South West","Poole",6000,54000,11.111111111111111,285,290,285,0,-5,"Robert","Syms","Conservative",{"$f":"IF(M458=Q458, \"Hold\", \"Change\")","v":"Hold"},"Robert","Syms","Conservative",6000,400,{"$f":"IF(L458=P458, \"Same MP\", \"New MP\")","v":"Same MP"},"Robert Syms",null,"Manufacturing Dependent",12.727272727272727,{"$f":"ROUND(X458,1)","v":12.7},12.7,310,{"$f":"VLOOKUP(B458,'2022emp'!$A$2:$B$633,2,FALSE)","v":6000},{"$f":"VLOOKUP(B458,'2022emp'!$A$2:$F$633,4,FALSE)","v":53000},{"$f":"VLOOKUP(B458,'2022emp'!$A$2:$H$633,7,FALSE)","v":6000},{"$f":"VLOOKUP(B458,'2022emp'!$A$2:$H$633,8,FALSE)","v":450},{"$f":"AA458-G458","v":20},{"$f":"(AB458/AC458)*100","v":11.320754716981133},{"$f":"IF(AG458>26.79, \"Extremely Manufacturing Dependent\", IF(AG458>17.86, \"Very Manufacturing Dependent\", IF(AG458>8.93, \"Manufacturing Dependent\", \"Not Manufacturing Dependent\")))","v":"Manufacturing Dependent"},{"$f":"ROUND(AG458,1)","v":11.3}]
["London","Poplar and Limehouse",1250,188000,{"$f":"(C459/D459)*100","v":0.66489361702127658},190,155,170,20,35,"Apsana","Begum","Labour","Hold","Apsana","Begum","Labour",1000,225,"Same MP","Apsana Begum",null,"Not Manufacturing Dependent",1.153846153846154,1.2,1.2,185,{"$f":"VLOOKUP(B459,'2022emp'!$A$2:$B$633,2,FALSE)","v":1250},{"$f":"VLOOKUP(B459,'2022emp'!$A$2:$F$633,4,FALSE)","v":195000},{"$f":"VLOOKUP(B459,'2022emp'!$A$2:$H$633,7,FALSE)","v":1000},{"$f":"VLOOKUP(B459,'2022emp'!$A$2:$H$633,8,FALSE)","v":175},30,0.64102564102564097,"Not Manufacturing Dependent",0.6]
["South East","Portsmouth North",6000,58000,10.344827586206897,240,245,235,5,-5,"Penny","Mordaunt","Conservative","Hold","Penny","Mordaunt","Conservative",6000,600,"Same MP","Penny Mordaunt",null,"Manufacturing Dependent",10,10,10,195,{"$f":"VLOOKUP(B460,'2022emp'!$A$2:$B$633,2,FALSE)","v":6000},{"$f":"VLOOKUP(B460,'2022emp'!$A$2:$F$633,4,FALSE)","v":62000},{"$f":"VLOOKUP(B460,'2022emp'!$A$2:$H$633,7,FALSE)","v":5000},{"$f":"VLOOKUP(B460,'2022emp'!$A$2:$H$633,8,FALSE)","v":450},-50,9.67741935483871,"Manufacturing Dependent",9.6999999999999993]
["South East","Portsmouth South",3000,43000,6.9767441860465116,120,105,110,10,15,"Stephen","Morgan","Labour","Hold","Stephen","Morgan","Labour",2500,300,"Same MP","Stephen Morgan",null,"Not Manufacturing Dependent",5.4347826086956523,5.4,5.4,90,{"$f":"VLOOKUP(B461,'2022emp'!$A$2:$B$633,2,FALSE)","v":2500},{"$f":"VLOOKUP(B461,'2022emp'!$A$2:$F$633,4,FALSE)","v":44000},{"$f":"VLOOKUP(B461,'2022emp'!$A$2:$H$633,7,FALSE)","v":2500},{"$f":"VLOOKUP(B461,'2022emp'!$A$2:$H$633,8,FALSE)","v":125},-15,5.6818181818181817,"Not Manufacturing Dependent",5.7]
["Wales","Preseli Pembrokeshire",1250,26000,4.8076923076923084,315,195,210,105,120,"Stephen","Crabb","Conservative","Hold","Stephen","Crabb","Conservative",1250,175,"Same MP","Stephen Crabb",null,"Not Manufacturing Dependent",4.8076923076923084,4.8,4.8,210,{"$f":"VLOOKUP(B462,'2022emp'!$A$2:$B$633,2,FALSE)","v":1250},{"$f":"VLOOKUP(B462,'2022emp'!$A$2:$F$633,4,FALSE)","v":26000},{"$f":"VLOOKUP(B462,'2022emp'!$A$2:$H$633,7,FALSE)","v":1000},{"$f":"VLOOKUP(B462,'2022emp'!$A$2:$H$633,8,FALSE)","v":125},15,4.8076923076923084,"Not Manufacturing Dependent",4.8]
["North West","Preston",3500,61000,5.7377049180327866,200,180,185,15,20,"Mark","Hendrick","Labour/Co-operative","Hold","Mark","Hendrick","Labour/Co-operative",3000,400,"Same MP","Mark Hendrick",null,"Not Manufacturing Dependent",5.5555555555555554,5.6,5.6,190,{"$f":"VLOOKUP(B463,'2022emp'!$A$2:$B$633,2,FALSE)","v":3500},{"$f":"VLOOKUP(B463,'2022emp'!$A$2:$F$633,4,FALSE)","v":66000},{"$f":"VLOOKUP(B463,'2022emp'!$A$2:$H$633,7,FALSE)","v":3000},{"$f":"VLOOKUP(B463,'2022emp'!$A$2:$H$633,8,FALSE)","v":600},10,5.3030303030303028,"Not Manufacturing Dependent",5.3]
["Yorkshire & the Humber","Pudsey",3500,33000,10.606060606060606,225,220,225,0,5,"Stuart","Andrew","Conservative","Hold","Stuart","Andrew","Conservative",3000,300,"Same MP","Stuart Andrew",null,"Manufacturing Dependent",11.76470588235294,11.8,11.8,235,{"$f":"VLOOKUP(B464,'2022emp'!$A$2:$B$633,2,FALSE)","v":4500},{"$f":"VLOOKUP(B464,'2022emp'!$A$2:$F$633,4,FALSE)","v":34000},{"$f":"VLOOKUP(B464,'2022emp'!$A$2:$H$633,7,FALSE)","v":4000},{"$f":"VLOOKUP(B464,'2022emp'!$A$2:$H$633,8,FALSE)","v":400},15,13.23529411764706,"Manufacturing Dependent",13.2]
["London","Putney",300,30000,1,100,95,90,10,5,"Fleur","Anderson","Labour","Hold","Fleur","Anderson","Labour",250,45,"Same MP","Fleur Anderson",null,"Not Manufacturing Dependent",0.80645161290322576,0.8,0.8,100,{"$f":"VLOOKUP(B465,'2022emp'!$A$2:$B$633,2,FALSE)","v":400},{"$f":"VLOOKUP(B465,'2022emp'!$A$2:$F$633,4,FALSE)","v":30000},{"$f":"VLOOKUP(B465,'2022emp'!$A$2:$H$633,7,FALSE)","v":350},{"$f":"VLOOKUP(B465,'2022emp'!$A$2:$H$633,8,FALSE)","v":50},5,1.3333333333333335,"Not Manufacturing Dependent",1.3]
["Eastern","Rayleigh and Wickford",2000,24000,8.3333333333333321,290,290,295,-5,0,"Mark","Francois","Conservative","Hold","Mark","Francois","Conservative",1750,200,"Same MP","Mark Francois",null,"Manufacturing Dependent",8.695652173913043,8.6999999999999993,8.6999999999999993,280,{"$f":"VLOOKUP(B466,'2022emp'!$A$2:$B$633,2,FALSE)","v":1750},{"$f":"VLOOKUP(B466,'2022emp'!$A$2:$F$633,4,FALSE)","v":24000},{"$f":"VLOOKUP(B466,'2022emp'!$A$2:$H$633,7,FALSE)","v":1750},{"$f":"VLOOKUP(B466,'2022emp'!$A$2:$H$633,8,FALSE)","v":250},-10,7.291666666666667,"Not Manufacturing Dependent",7.3]
["South East","Reading East",1750,87000,2.0114942528735633,160,140,150,10,20,"Matt","Rodda","Labour","Hold","Matt","Rodda","Labour",1750,225,"Same MP","Matt Rodda",null,"Not Manufacturing Dependent",1.7441860465116279,1.7,1.7,180,{"$f":"VLOOKUP(B467,'2022emp'!$A$2:$B$633,2,FALSE)","v":1750},{"$f":"VLOOKUP(B467,'2022emp'!$A$2:$F$633,4,FALSE)","v":95000},{"$f":"VLOOKUP(B467,'2022emp'!$A$2:$H$633,7,FALSE)","v":1500},{"$f":"VLOOKUP(B467,'2022emp'!$A$2:$H$633,8,FALSE)","v":350},40,1.8421052631578945,"Not Manufacturing Dependent",1.8]
["South East","Reading West",1500,55000,2.7272727272727271,130,135,125,5,-5,"Alok","Sharma","Conservative","Hold","Alok","Sharma","Conservative",1250,200,"Same MP","Alok Sharma",null,"Not Manufacturing Dependent",3.3018867924528301,3.3,3.3,125,{"$f":"VLOOKUP(B468,'2022emp'!$A$2:$B$633,2,FALSE)","v":1750},{"$f":"VLOOKUP(B468,'2022emp'!$A$2:$F$633,4,FALSE)","v":64000},{"$f":"VLOOKUP(B468,'2022emp'!$A$2:$H$633,7,FALSE)","v":1500},{"$f":"VLOOKUP(B468,'2022emp'!$A$2:$H$633,8,FALSE)","v":150},-10,2.734375,"Not Manufacturing Dependent",2.7]
["North East","Redcar",3500,27000,12.962962962962962,170,150,155,15,20,"Jacob","Young","Conservative","Hold","Jacob","Young","Conservative",3500,150,"Same MP","Jacob Young",null,"Manufacturing Dependent",14.285714285714285,14.3,14.3,145,{"$f":"VLOOKUP(B469,'2022emp'!$A$2:$B$633,2,FALSE)","v":3500},{"$f":"VLOOKUP(B469,'2022emp'!$A$2:$F$633,4,FALSE)","v":27000},{"$f":"VLOOKUP(B469,'2022emp'!$A$2:$H$633,7,FALSE)","v":3000},{"$f":"VLOOKUP(B469,'2022emp'!$A$2:$H$633,8,FALSE)","v":300},-5,12.962962962962962,"Manufacturing Dependent",13]
["West Midlands","Redditch",8000,41000,19.512195121951219,340,335,340,0,5,"Rachel","Maclean","Conservative","Hold","Rachel","Maclean","Conservative",7000,600,"Same MP","Rachel Maclean",null,"Very Manufacturing Dependent",21.951219512195124,22,22,350,{"$f":"VLOOKUP(B470,'2022emp'!$A$2:$B$633,2,FALSE)","v":8000},{"$f":"VLOOKUP(B470,'2022emp'!$A$2:$F$633,4,FALSE)","v":40000},{"$f":"VLOOKUP(B470,'2022emp'!$A$2:$H$633,7,FALSE)","v":7000},{"$f":"VLOOKUP(B470,'2022emp'!$A$2:$H$633,8,FALSE)","v":600},15,20,"Very Manufacturing Dependent",20]
["South East","Reigate",2000,57000,3.5087719298245612,185,185,185,0,0,"Crispin","Blunt","Conservative","Hold","Crispin","Blunt","Conservative",1750,200,"Same MP","Crispin Blunt",null,"Not Manufacturing Dependent",3.5087719298245612,3.5,3.5,180,{"$f":"VLOOKUP(B471,'2022emp'!$A$2:$B$633,2,FALSE)","v":2000},{"$f":"VLOOKUP(B471,'2022emp'!$A$2:$F$633,4,FALSE)","v":58000},{"$f":"VLOOKUP(B471,'2022emp'!$A$2:$H$633,7,FALSE)","v":1750},{"$f":"VLOOKUP(B471,'2022emp'!$A$2:$H$633,8,FALSE)","v":200},-5,3.4482758620689653,"Not Manufacturing Dependent",3.4]
["Wales","Rhondda",1750,13000,13.461538461538462,85,85,90,-5,0,"Chris","Bryant","Labour","Hold","Chris","Bryant","Labour",1500,100,"Same MP","Chris Bryant",null,"Manufacturing Dependent",13.461538461538462,13.5,13.5,90,{"$f":"VLOOKUP(B472,'2022emp'!$A$2:$B$633,2,FALSE)","v":1500},{"$f":"VLOOKUP(B472,'2022emp'!$A$2:$F$633,4,FALSE)","v":14000},{"$f":"VLOOKUP(B472,'2022emp'!$A$2:$H$633,7,FALSE)","v":1250},{"$f":"VLOOKUP(B472,'2022emp'!$A$2:$H$633,8,FALSE)","v":125},5,10.714285714285714,"Manufacturing Dependent",10.7]
["North West","Ribble Valley",13000,62000,20.967741935483872,320,320,325,-5,0,"Nigel","Evans","Conservative","Hold","Nigel","Evans","Conservative",12000,700,"Same MP","Nigel Evans",null,"Very Manufacturing Dependent",20.33898305084746,20.3,20.3,330,{"$f":"VLOOKUP(B473,'2022emp'!$A$2:$B$633,2,FALSE)","v":12000},{"$f":"VLOOKUP(B473,'2022emp'!$A$2:$F$633,4,FALSE)","v":56000},{"$f":"VLOOKUP(B473,'2022emp'!$A$2:$H$633,7,FALSE)","v":11000},{"$f":"VLOOKUP(B473,'2022emp'!$A$2:$H$633,8,FALSE)","v":800},10,21.428571428571427,"Very Manufacturing Dependent",21.4]
["Yorkshire & the Humber","Richmond (Yorks)",5000,40000,12.5,280,260,260,20,20,"Rishi","Sunak","Conservative","Hold","Rishi","Sunak","Conservative",4500,800,"Same MP","Rishi Sunak",null,"Manufacturing Dependent",9.3023255813953494,9.3000000000000007,9.3000000000000007,260,{"$f":"VLOOKUP(B474,'2022emp'!$A$2:$B$633,2,FALSE)","v":4000},{"$f":"VLOOKUP(B474,'2022emp'!$A$2:$F$633,4,FALSE)","v":43000},{"$f":"VLOOKUP(B474,'2022emp'!$A$2:$H$633,7,FALSE)","v":3500},{"$f":"VLOOKUP(B474,'2022emp'!$A$2:$H$633,8,FALSE)","v":600},0,9.3023255813953494,"Manufacturing Dependent",9.3000000000000007]
["London","Richmond Park",500,49000,1.0204081632653061,170,175,160,10,-5,"Sarah","Olney","Liberal Democrat","Hold","Sarah","Olney","Liberal Democrat",400,100,"Same MP","Sarah Olney",null,"Not Manufacturing Dependent",1.1764705882352942,1.2,1.2,165,{"$f":"VLOOKUP(B475,'2022emp'!$A$2:$B$633,2,FALSE)","v":600},{"$f":"VLOOKUP(B475,'2022emp'!$A$2:$F$633,4,FALSE)","v":55000},{"$f":"VLOOKUP(B475,'2022emp'!$A$2:$H$633,7,FALSE)","v":450},{"$f":"VLOOKUP(B475,'2022emp'!$A$2:$H$633,8,FALSE)","v":100},-10,1.0909090909090911,"Not Manufacturing Dependent",1.1000000000000001]
["North West","Rochdale",6000,40000,15,315,310,310,5,5,"George","Galloway","Workers Party","Change","Tony","Lloyd","Labour",5000,800,"New MP","George Galloway",null,"Manufacturing Dependent",14.285714285714285,14.3,14.3,295,{"$f":"VLOOKUP(B476,'2022emp'!$A$2:$B$633,2,FALSE)","v":5000},{"$f":"VLOOKUP(B476,'2022emp'!$A$2:$F$633,4,FALSE)","v":43000},{"$f":"VLOOKUP(B476,'2022emp'!$A$2:$H$633,7,FALSE)","v":5000},{"$f":"VLOOKUP(B476,'2022emp'!$A$2:$H$633,8,FALSE)","v":500},-15,11.627906976744185,"Manufacturing Dependent",11.6]
["South East","Rochester and Strood",5000,54000,9.2592592592592595,265,265,265,0,0,"Kelly","Tolhurst","Conservative","Hold","Kelly","Tolhurst","Conservative",4500,500,"Same MP","Kelly Tolhurst",null,"Manufacturing Dependent",8.3333333333333321,8.3000000000000007,8.3000000000000007,255,{"$f":"VLOOKUP(B477,'2022emp'!$A$2:$B$633,2,FALSE)","v":4500},{"$f":"VLOOKUP(B477,'2022emp'!$A$2:$F$633,4,FALSE)","v":56000},{"$f":"VLOOKUP(B477,'2022emp'!$A$2:$H$633,7,FALSE)","v":4000},{"$f":"VLOOKUP(B477,'2022emp'!$A$2:$H$633,8,FALSE)","v":350},-10,8.0357142857142865,"Not Manufacturing Dependent",8]
["Eastern","Rochford and Southend East",4000,44000,9.0909090909090917,255,250,250,5,5,"James","Duddridge","Conservative","Hold","James","Duddridge","Conservative",3500,450,"Same MP","James Duddridge",null,"Manufacturing Dependent",9.0909090909090917,9.1,9.1,260,{"$f":"VLOOKUP(B478,'2022emp'!$A$2:$B$633,2,FALSE)","v":4000},{"$f":"VLOOKUP(B478,'2022emp'!$A$2:$F$633,4,FALSE)","v":45000},{"$f":"VLOOKUP(B478,'2022emp'!$A$2:$H$633,7,FALSE)","v":3500},{"$f":"VLOOKUP(B478,'2022emp'!$A$2:$H$633,8,FALSE)","v":350},10,8.8888888888888893,"Not Manufacturing Dependent",8.9]
["London","Romford",800,41000,1.9512195121951219,145,145,160,-15,0,"Andrew","Rosindell","Conservative","Hold","Andrew","Rosindell","Conservative",700,125,"Same MP","Andrew Rosindell",null,"Not Manufacturing Dependent",1.7500000000000002,1.8,1.8,140,{"$f":"VLOOKUP(B479,'2022emp'!$A$2:$B$633,2,FALSE)","v":600},{"$f":"VLOOKUP(B479,'2022emp'!$A$2:$F$633,4,FALSE)","v":42000},{"$f":"VLOOKUP(B479,'2022emp'!$A$2:$H$633,7,FALSE)","v":500},{"$f":"VLOOKUP(B479,'2022emp'!$A$2:$H$633,8,FALSE)","v":100},-5,1.4285714285714286,"Not Manufacturing Dependent",1.4]
["South East","Romsey and Southampton North",2500,32000,7.8125,220,210,225,-5,10,"Caroline","Nokes","Conservative","Hold","Caroline","Nokes","Conservative",2250,300,"Same MP","Caroline Nokes",null,"Not Manufacturing Dependent",7.8125,7.8,7.8,215,{"$f":"VLOOKUP(B480,'2022emp'!$A$2:$B$633,2,FALSE)","v":2500},{"$f":"VLOOKUP(B480,'2022emp'!$A$2:$F$633,4,FALSE)","v":34000},{"$f":"VLOOKUP(B480,'2022emp'!$A$2:$H$633,7,FALSE)","v":2250},{"$f":"VLOOKUP(B480,'2022emp'!$A$2:$H$633,8,FALSE)","v":350},5,7.3529411764705888,"Not Manufacturing Dependent",7.4]
["Scotland","Ross, Skye and Lochaber",1750,25000,7.0000000000000009,190,180,175,15,10,"Ian","Blackford","Scottish National Party","Hold","Ian","Blackford","Scottish National Party",1750,125,"Same MP","Ian Blackford",null,"Not Manufacturing Dependent",7.4074074074074066,7.4,7.4,175,{"$f":"VLOOKUP(B481,'2022emp'!$A$2:$B$633,2,FALSE)","v":1750},{"$f":"VLOOKUP(B481,'2022emp'!$A$2:$F$633,4,FALSE)","v":28000},{"$f":"VLOOKUP(B481,'2022emp'!$A$2:$H$633,7,FALSE)","v":1500},{"$f":"VLOOKUP(B481,'2022emp'!$A$2:$H$633,8,FALSE)","v":200},-5,6.25,"Not Manufacturing Dependent",6.3]
["North West","Rossendale and Darwen",5000,25000,20,290,300,290,0,-10,"Jake","Berry","Conservative","Hold","Jake","Berry","Conservative",5000,450,"Same MP","Jake Berry",null,"Very Manufacturing Dependent",22.222222222222221,22.2,22.2,275,{"$f":"VLOOKUP(B482,'2022emp'!$A$2:$B$633,2,FALSE)","v":6000},{"$f":"VLOOKUP(B482,'2022emp'!$A$2:$F$633,4,FALSE)","v":27000},{"$f":"VLOOKUP(B482,'2022emp'!$A$2:$H$633,7,FALSE)","v":5000},{"$f":"VLOOKUP(B482,'2022emp'!$A$2:$H$633,8,FALSE)","v":450},-25,22.222222222222221,"Very Manufacturing Dependent",22.2]
["Yorkshire & the Humber","Rother Valley",4500,26000,17.307692307692307,220,205,205,15,15,"Alexander","Stafford","Conservative","Hold","Alexander","Stafford","Conservative",4000,350,"Same MP","Alexander Stafford",null,"Very Manufacturing Dependent",17.307692307692307,17.3,17.3,220,{"$f":"VLOOKUP(B483,'2022emp'!$A$2:$B$633,2,FALSE)","v":4000},{"$f":"VLOOKUP(B483,'2022emp'!$A$2:$F$633,4,FALSE)","v":25000},{"$f":"VLOOKUP(B483,'2022emp'!$A$2:$H$633,7,FALSE)","v":3500},{"$f":"VLOOKUP(B483,'2022emp'!$A$2:$H$633,8,FALSE)","v":450},15,16,"Manufacturing Dependent",16]
["Yorkshire & the Humber","Rotherham",7000,44000,15.909090909090908,205,195,205,0,10,"Sarah","Champion","Labour","Hold","Sarah","Champion","Labour",7000,450,"Same MP","Sarah Champion",null,"Manufacturing Dependent",16.279069767441861,16.3,16.3,205,{"$f":"VLOOKUP(B484,'2022emp'!$A$2:$B$633,2,FALSE)","v":7000},{"$f":"VLOOKUP(B484,'2022emp'!$A$2:$F$633,4,FALSE)","v":45000},{"$f":"VLOOKUP(B484,'2022emp'!$A$2:$H$633,7,FALSE)","v":6000},{"$f":"VLOOKUP(B484,'2022emp'!$A$2:$H$633,8,FALSE)","v":900},10,15.555555555555555,"Manufacturing Dependent",15.6]
["West Midlands","Rugby",5000,44000,11.363636363636363,235,230,230,5,5,"Mark","Pawsey","Conservative","Hold","Mark","Pawsey","Conservative",5000,300,"Same MP","Mark Pawsey",null,"Manufacturing Dependent",9.3023255813953494,9.3000000000000007,9.3000000000000007,270,{"$f":"VLOOKUP(B485,'2022emp'!$A$2:$B$633,2,FALSE)","v":6000},{"$f":"VLOOKUP(B485,'2022emp'!$A$2:$F$633,4,FALSE)","v":49000},{"$f":"VLOOKUP(B485,'2022emp'!$A$2:$H$633,7,FALSE)","v":6000},{"$f":"VLOOKUP(B485,'2022emp'!$A$2:$H$633,8,FALSE)","v":450},40,12.244897959183673,"Manufacturing Dependent",12.2]
["London","Ruislip, Northwood and Pinner",225,33000,0.68181818181818177,130,125,120,10,5,"David","Simmonds","Conservative","Hold","David","Simmonds","Conservative",200,35,"Same MP","David Simmonds",null,"Not Manufacturing Dependent",0.9375,0.9,0.9,130,{"$f":"VLOOKUP(B486,'2022emp'!$A$2:$B$633,2,FALSE)","v":350},{"$f":"VLOOKUP(B486,'2022emp'!$A$2:$F$633,4,FALSE)","v":36000},{"$f":"VLOOKUP(B486,'2022emp'!$A$2:$H$633,7,FALSE)","v":300},{"$f":"VLOOKUP(B486,'2022emp'!$A$2:$H$633,8,FALSE)","v":50},5,0.97222222222222221,"Not Manufacturing Dependent",1]
["South East","Runnymede and Weybridge",2000,76000,2.6315789473684208,250,245,250,0,5,"Ben","Spencer","Conservative","Hold","Ben","Spencer","Conservative",1750,200,"Same MP","Ben Spencer",null,"Not Manufacturing Dependent",2.9220779220779218,2.9,2.9,235,{"$f":"VLOOKUP(B487,'2022emp'!$A$2:$B$633,2,FALSE)","v":1500},{"$f":"VLOOKUP(B487,'2022emp'!$A$2:$F$633,4,FALSE)","v":82000},{"$f":"VLOOKUP(B487,'2022emp'!$A$2:$H$633,7,FALSE)","v":1500},{"$f":"VLOOKUP(B487,'2022emp'!$A$2:$H$633,8,FALSE)","v":175},-10,1.8292682926829267,"Not Manufacturing Dependent",1.8]
["East Midlands","Rushcliffe",2250,36000,6.25,200,185,195,5,15,"Ruth","Edwards","Conservative","Hold","Ruth","Edwards","Conservative",2000,250,"Same MP","Ruth Edwards",null,"Not Manufacturing Dependent",6.0810810810810816,6.1,6.1,185,{"$f":"VLOOKUP(B488,'2022emp'!$A$2:$B$633,2,FALSE)","v":2250},{"$f":"VLOOKUP(B488,'2022emp'!$A$2:$F$633,4,FALSE)","v":41000},{"$f":"VLOOKUP(B488,'2022emp'!$A$2:$H$633,7,FALSE)","v":2000},{"$f":"VLOOKUP(B488,'2022emp'!$A$2:$H$633,8,FALSE)","v":250},0,5.4878048780487809,"Not Manufacturing Dependent",5.5]
["Scotland","Rutherglen and Hamilton West",2250,28000,8.0357142857142865,175,180,170,5,-5,"Michael","Shanks","Labour","Change","Margaret","Ferrier","Scottish National Party",2000,300,"New MP","Michael Shanks",null,"Not Manufacturing Dependent",10,10,10,160,{"$f":"VLOOKUP(B489,'2022emp'!$A$2:$B$633,2,FALSE)","v":2500},{"$f":"VLOOKUP(B489,'2022emp'!$A$2:$F$633,4,FALSE)","v":28000},{"$f":"VLOOKUP(B489,'2022emp'!$A$2:$H$633,7,FALSE)","v":2000},{"$f":"VLOOKUP(B489,'2022emp'!$A$2:$H$633,8,FALSE)","v":300},-20,8.9285714285714288,"Not Manufacturing Dependent",8.9]
["East Midlands","Rutland and Melton",7000,38000,18.421052631578945,305,290,295,10,15,"Alicia","Kearns","Conservative","Hold","Alicia","Kearns","Conservative",5000,1250,"Same MP","Alicia Kearns",null,"Very Manufacturing Dependent",18.918918918918919,18.899999999999999,18.899999999999999,300,{"$f":"VLOOKUP(B490,'2022emp'!$A$2:$B$633,2,FALSE)","v":7000},{"$f":"VLOOKUP(B490,'2022emp'!$A$2:$F$633,4,FALSE)","v":40000},{"$f":"VLOOKUP(B490,'2022emp'!$A$2:$H$633,7,FALSE)","v":6000},{"$f":"VLOOKUP(B490,'2022emp'!$A$2:$H$633,8,FALSE)","v":900},10,17.5,"Manufacturing Dependent",17.5]
["Eastern","Saffron Walden",3000,56000,5.3571428571428568,365,350,355,10,15,"Kemi","Badenoch","Conservative","Hold","Kemi","Badenoch","Conservative",2500,300,"Same MP","Kemi Badenoch",null,"Not Manufacturing Dependent",5.3571428571428568,5.4,5.4,365,{"$f":"VLOOKUP(B491,'2022emp'!$A$2:$B$633,2,FALSE)","v":3000},{"$f":"VLOOKUP(B491,'2022emp'!$A$2:$F$633,4,FALSE)","v":59000},{"$f":"VLOOKUP(B491,'2022emp'!$A$2:$H$633,7,FALSE)","v":2500},{"$f":"VLOOKUP(B491,'2022emp'!$A$2:$H$633,8,FALSE)","v":450},15,5.0847457627118651,"Not Manufacturing Dependent",5.0999999999999996]
["North West","Salford and Eccles",4000,102000,3.9215686274509802,220,205,205,15,15,"Rebecca","Long-Bailey","Labour","Hold","Rebecca","Long-Bailey","Labour",3500,500,"Same MP","Rebecca Long-Bailey",null,"Not Manufacturing Dependent",4.6875,4.7,4.7,240,{"$f":"VLOOKUP(B492,'2022emp'!$A$2:$B$633,2,FALSE)","v":4000},{"$f":"VLOOKUP(B492,'2022emp'!$A$2:$F$633,4,FALSE)","v":120000},{"$f":"VLOOKUP(B492,'2022emp'!$A$2:$H$633,7,FALSE)","v":3500},{"$f":"VLOOKUP(B492,'2022emp'!$A$2:$H$633,8,FALSE)","v":450},35,3.3333333333333335,"Not Manufacturing Dependent",3.3]
["South West","Salisbury",3500,49000,7.1428571428571423,215,215,215,0,0,"John","Glen","Conservative","Hold","John","Glen","Conservative",3000,300,"Same MP","John Glen",null,"Not Manufacturing Dependent",6.3829787234042552,6.4,6.4,205,{"$f":"VLOOKUP(B493,'2022emp'!$A$2:$B$633,2,FALSE)","v":3000},{"$f":"VLOOKUP(B493,'2022emp'!$A$2:$F$633,4,FALSE)","v":52000},{"$f":"VLOOKUP(B493,'2022emp'!$A$2:$H$633,7,FALSE)","v":3000},{"$f":"VLOOKUP(B493,'2022emp'!$A$2:$H$633,8,FALSE)","v":300},-10,5.7692307692307692,"Not Manufacturing Dependent",5.8]
["Yorkshire & the Humber","Scarborough and Whitby",4500,38000,11.842105263157894,185,190,190,-5,-5,"Robert","Goodwill","Conservative","Hold","Robert","Goodwill","Conservative",4000,450,"Same MP","Robert Goodwill",null,"Manufacturing Dependent",12.820512820512819,12.8,12.8,175,{"$f":"VLOOKUP(B494,'2022emp'!$A$2:$B$633,2,FALSE)","v":5000},{"$f":"VLOOKUP(B494,'2022emp'!$A$2:$F$633,4,FALSE)","v":41000},{"$f":"VLOOKUP(B494,'2022emp'!$A$2:$H$633,7,FALSE)","v":4000},{"$f":"VLOOKUP(B494,'2022emp'!$A$2:$H$633,8,FALSE)","v":500},-15,12.195121951219512,"Manufacturing Dependent",12.2]
["Yorkshire & the Humber","Scunthorpe",11000,43000,25.581395348837212,170,165,165,5,5,"Holly","Mumby-Croft","Conservative","Hold","Holly","Mumby-Croft","Conservative",10000,400,"Same MP","Holly Mumby-Croft",null,"Extremely Manufacturing Dependent",24.444444444444443,24.4,24.4,165,{"$f":"VLOOKUP(B495,'2022emp'!$A$2:$B$633,2,FALSE)","v":11000},{"$f":"VLOOKUP(B495,'2022emp'!$A$2:$F$633,4,FALSE)","v":43000},{"$f":"VLOOKUP(B495,'2022emp'!$A$2:$H$633,7,FALSE)","v":10000},{"$f":"VLOOKUP(B495,'2022emp'!$A$2:$H$633,8,FALSE)","v":500},0,25.581395348837212,"Very Manufacturing Dependent",25.6]
["North East","Sedgefield",7000,35000,20,220,205,195,25,15,"Paul","Howell","Conservative","Hold","Paul","Howell","Conservative",7000,250,"Same MP","Paul Howell",null,"Very Manufacturing Dependent",29.032258064516132,29,29,210,{"$f":"VLOOKUP(B496,'2022emp'!$A$2:$B$633,2,FALSE)","v":7000},{"$f":"VLOOKUP(B496,'2022emp'!$A$2:$F$633,4,FALSE)","v":33000},{"$f":"VLOOKUP(B496,'2022emp'!$A$2:$H$633,7,FALSE)","v":7000},{"$f":"VLOOKUP(B496,'2022emp'!$A$2:$H$633,8,FALSE)","v":600},5,21.212121212121211,"Very Manufacturing Dependent",21.2]
["North West","Sefton Central",700,23000,3.0434782608695654,110,90,100,10,20,"Bill","Esterson","Labour","Hold","Bill","Esterson","Labour",600,125,"Same MP","Bill Esterson",null,"Not Manufacturing Dependent",2.1428571428571428,2.1,2.1,100,{"$f":"VLOOKUP(B497,'2022emp'!$A$2:$B$633,2,FALSE)","v":700},{"$f":"VLOOKUP(B497,'2022emp'!$A$2:$F$633,4,FALSE)","v":21000},{"$f":"VLOOKUP(B497,'2022emp'!$A$2:$H$633,7,FALSE)","v":600},{"$f":"VLOOKUP(B497,'2022emp'!$A$2:$H$633,8,FALSE)","v":100},10,3.3333333333333335,"Not Manufacturing Dependent",3.3]
["Yorkshire & the Humber","Selby and Ainsty",8000,40000,20,305,275,285,20,30,"Keir","Mather","Labour","Change","Nigel","Adams","Conservative",7000,600,"New MP","Keir Mather",null,"Very Manufacturing Dependent",16.666666666666664,16.7,16.7,305,{"$f":"VLOOKUP(B498,'2022emp'!$A$2:$B$633,2,FALSE)","v":8000},{"$f":"VLOOKUP(B498,'2022emp'!$A$2:$F$633,4,FALSE)","v":42000},{"$f":"VLOOKUP(B498,'2022emp'!$A$2:$H$633,7,FALSE)","v":8000},{"$f":"VLOOKUP(B498,'2022emp'!$A$2:$H$633,8,FALSE)","v":500},30,19.047619047619047,"Very Manufacturing Dependent",19]
["South East","Sevenoaks",2500,40000,6.25,220,225,230,-10,-5,"Laura","Trott","Conservative","Hold","Laura","Trott","Conservative",2000,300,"Same MP","Laura Trott",null,"Not Manufacturing Dependent",5.4878048780487809,5.5,5.5,210,{"$f":"VLOOKUP(B499,'2022emp'!$A$2:$B$633,2,FALSE)","v":2000},{"$f":"VLOOKUP(B499,'2022emp'!$A$2:$F$633,4,FALSE)","v":41000},{"$f":"VLOOKUP(B499,'2022emp'!$A$2:$H$633,7,FALSE)","v":1750},{"$f":"VLOOKUP(B499,'2022emp'!$A$2:$H$633,8,FALSE)","v":200},-15,4.8780487804878048,"Not Manufacturing Dependent",4.9000000000000004]
["Yorkshire & the Humber","Sheffield Central",4500,109000,4.1284403669724776,335,355,345,-10,-20,"Paul","Blomfield","Labour","Hold","Paul","Blomfield","Labour",4000,350,"Same MP","Paul Blomfield",null,"Not Manufacturing Dependent",4.5871559633027523,4.5999999999999996,4.5999999999999996,355,{"$f":"VLOOKUP(B500,'2022emp'!$A$2:$B$633,2,FALSE)","v":5000},{"$f":"VLOOKUP(B500,'2022emp'!$A$2:$F$633,4,FALSE)","v":116000},{"$f":"VLOOKUP(B500,'2022emp'!$A$2:$H$633,7,FALSE)","v":4500},{"$f":"VLOOKUP(B500,'2022emp'!$A$2:$H$633,8,FALSE)","v":450},0,4.3103448275862073,"Not Manufacturing Dependent",4.3]
["Yorkshire & the Humber","Sheffield South East",8000,61000,13.114754098360656,375,370,375,0,5,"Clive","Betts","Labour","Hold","Clive","Betts","Labour",7000,800,"Same MP","Clive Betts",null,"Manufacturing Dependent",15.384615384615385,15.4,15.4,360,{"$f":"VLOOKUP(B501,'2022emp'!$A$2:$B$633,2,FALSE)","v":8000},{"$f":"VLOOKUP(B501,'2022emp'!$A$2:$F$633,4,FALSE)","v":63000},{"$f":"VLOOKUP(B501,'2022emp'!$A$2:$H$633,7,FALSE)","v":7000},{"$f":"VLOOKUP(B501,'2022emp'!$A$2:$H$633,8,FALSE)","v":600},-10,12.698412698412698,"Manufacturing Dependent",12.7]
["Yorkshire & the Humber","Sheffield, Brightside and Hillsborough",4000,36000,11.111111111111111,190,225,195,-5,-35,"Gill","Furniss","Labour","Hold","Gill","Furniss","Labour",3500,350,"Same MP","Gill Furniss",null,"Manufacturing Dependent",14.285714285714285,14.3,14.3,180,{"$f":"VLOOKUP(B502,'2022emp'!$A$2:$B$633,2,FALSE)","v":4000},{"$f":"VLOOKUP(B502,'2022emp'!$A$2:$F$633,4,FALSE)","v":36000},{"$f":"VLOOKUP(B502,'2022emp'!$A$2:$H$633,7,FALSE)","v":4000},{"$f":"VLOOKUP(B502,'2022emp'!$A$2:$H$633,8,FALSE)","v":450},-45,11.111111111111111,"Manufacturing Dependent",11.1]
["Yorkshire & the Humber","Sheffield, Hallam",225,17000,1.3235294117647058,85,95,90,-5,-10,"Olivia","Blake","Labour","Hold","Olivia Frances","Blake","Labour",200,30,"Same MP","Olivia Blake",null,"Not Manufacturing Dependent",1.9444444444444444,1.9,1.9,90,{"$f":"VLOOKUP(B503,'2022emp'!$A$2:$B$633,2,FALSE)","v":300},{"$f":"VLOOKUP(B503,'2022emp'!$A$2:$F$633,4,FALSE)","v":18000},{"$f":"VLOOKUP(B503,'2022emp'!$A$2:$H$633,7,FALSE)","v":250},{"$f":"VLOOKUP(B503,'2022emp'!$A$2:$H$633,8,FALSE)","v":35},-5,1.6666666666666667,"Not Manufacturing Dependent",1.7]
["Yorkshire & the Humber","Sheffield, Heeley",600,19000,3.1578947368421053,110,105,105,5,5,"Louise","Haigh","Labour","Hold","Louise","Haigh","Labour",600,75,"Same MP","Louise Haigh",null,"Not Manufacturing Dependent",3.1578947368421053,3.2,3.2,100,{"$f":"VLOOKUP(B504,'2022emp'!$A$2:$B$633,2,FALSE)","v":450},{"$f":"VLOOKUP(B504,'2022emp'!$A$2:$F$633,4,FALSE)","v":18000},{"$f":"VLOOKUP(B504,'2022emp'!$A$2:$H$633,7,FALSE)","v":400},{"$f":"VLOOKUP(B504,'2022emp'!$A$2:$H$633,8,FALSE)","v":75},-5,2.5,"Not Manufacturing Dependent",2.5]
["East Midlands","Sherwood",2500,30000,8.3333333333333321,245,255,250,-5,-10,"Mark","Spencer","Conservative","Hold","Mark","Spencer","Conservative",2500,225,"Same MP","Mark Spencer",null,"Manufacturing Dependent",10,10,10,260,{"$f":"VLOOKUP(B505,'2022emp'!$A$2:$B$633,2,FALSE)","v":2250},{"$f":"VLOOKUP(B505,'2022emp'!$A$2:$F$633,4,FALSE)","v":34000},{"$f":"VLOOKUP(B505,'2022emp'!$A$2:$H$633,7,FALSE)","v":1750},{"$f":"VLOOKUP(B505,'2022emp'!$A$2:$H$633,8,FALSE)","v":250},5,6.6176470588235299,"Not Manufacturing Dependent",6.6]
["Yorkshire & the Humber","Shipley",3500,28000,12.5,205,195,190,15,10,"Philip","Davies","Conservative","Hold","Philip","Davies","Conservative",3000,300,"Same MP","Philip Davies",null,"Manufacturing Dependent",11.666666666666666,11.7,11.7,200,{"$f":"VLOOKUP(B506,'2022emp'!$A$2:$B$633,2,FALSE)","v":3500},{"$f":"VLOOKUP(B506,'2022emp'!$A$2:$F$633,4,FALSE)","v":29000},{"$f":"VLOOKUP(B506,'2022emp'!$A$2:$H$633,7,FALSE)","v":3500},{"$f":"VLOOKUP(B506,'2022emp'!$A$2:$H$633,8,FALSE)","v":300},5,12.068965517241379,"Manufacturing Dependent",12.1]
["West Midlands","Shrewsbury and Atcham",2500,52000,4.8076923076923084,215,220,225,-10,-5,"Daniel","Kawczynski","Conservative","Hold","Daniel","Kawczynski","Conservative",2500,175,"Same MP","Daniel Kawczynski",null,"Not Manufacturing Dependent",5.8823529411764701,5.9,5.9,200,{"$f":"VLOOKUP(B507,'2022emp'!$A$2:$B$633,2,FALSE)","v":3000},{"$f":"VLOOKUP(B507,'2022emp'!$A$2:$F$633,4,FALSE)","v":54000},{"$f":"VLOOKUP(B507,'2022emp'!$A$2:$H$633,7,FALSE)","v":3000},{"$f":"VLOOKUP(B507,'2022emp'!$A$2:$H$633,8,FALSE)","v":450},-20,5.5555555555555554,"Not Manufacturing Dependent",5.6]
["South East","Sittingbourne and Sheppey",5000,39000,12.820512820512819,275,250,265,10,25,"Gordon","Henderson","Conservative","Hold","Gordon","Henderson","Conservative",4500,500,"Same MP","Gordon Henderson",null,"Manufacturing Dependent",15,15,15,265,{"$f":"VLOOKUP(B508,'2022emp'!$A$2:$B$633,2,FALSE)","v":5000},{"$f":"VLOOKUP(B508,'2022emp'!$A$2:$F$633,4,FALSE)","v":42000},{"$f":"VLOOKUP(B508,'2022emp'!$A$2:$H$633,7,FALSE)","v":4500},{"$f":"VLOOKUP(B508,'2022emp'!$A$2:$H$633,8,FALSE)","v":450},15,11.904761904761903,"Manufacturing Dependent",11.9]
["Yorkshire & the Humber","Skipton and Ripon",5000,47000,10.638297872340425,325,325,315,10,0,"Julian","Smith","Conservative","Hold","Julian","Smith","Conservative",5000,500,"Same MP","Julian Smith",null,"Manufacturing Dependent",10.638297872340425,10.6,10.6,345,{"$f":"VLOOKUP(B509,'2022emp'!$A$2:$B$633,2,FALSE)","v":5000},{"$f":"VLOOKUP(B509,'2022emp'!$A$2:$F$633,4,FALSE)","v":48000},{"$f":"VLOOKUP(B509,'2022emp'!$A$2:$H$633,7,FALSE)","v":5000},{"$f":"VLOOKUP(B509,'2022emp'!$A$2:$H$633,8,FALSE)","v":500},20,10.416666666666668,"Manufacturing Dependent",10.4]
["East Midlands","Sleaford and North Hykeham",6000,42000,14.285714285714285,275,270,265,10,5,"Caroline","Johnson","Conservative","Hold","Caroline","Johnson","Conservative",5000,300,"Same MP","Caroline Johnson",null,"Manufacturing Dependent",14.285714285714285,14.3,14.3,260,{"$f":"VLOOKUP(B510,'2022emp'!$A$2:$B$633,2,FALSE)","v":6000},{"$f":"VLOOKUP(B510,'2022emp'!$A$2:$F$633,4,FALSE)","v":44000},{"$f":"VLOOKUP(B510,'2022emp'!$A$2:$H$633,7,FALSE)","v":6000},{"$f":"VLOOKUP(B510,'2022emp'!$A$2:$H$633,8,FALSE)","v":300},-10,13.636363636363635,"Manufacturing Dependent",13.6]
["South East","Slough",5000,71000,7.042253521126761,235,230,235,0,5,"Tan","Dhesi","Labour","Hold","Tan","Dhesi","Labour",5000,500,"Same MP","Tan Dhesi",null,"Not Manufacturing Dependent",5.4794520547945202,5.5,5.5,200,{"$f":"VLOOKUP(B511,'2022emp'!$A$2:$B$633,2,FALSE)","v":5000},{"$f":"VLOOKUP(B511,'2022emp'!$A$2:$F$633,4,FALSE)","v":72000},{"$f":"VLOOKUP(B511,'2022emp'!$A$2:$H$633,7,FALSE)","v":4500},{"$f":"VLOOKUP(B511,'2022emp'!$A$2:$H$633,8,FALSE)","v":500},-30,6.9444444444444446,"Not Manufacturing Dependent",6.9]
["West Midlands","Solihull",10000,58000,17.241379310344829,120,135,130,-10,-15,"Julian","Knight","Independent","Change","Julian","Knight","Conservative",10000,100,"Same MP","Julian Knight",null,"Very Manufacturing Dependent",17.241379310344829,17.2,17.2,105,{"$f":"VLOOKUP(B512,'2022emp'!$A$2:$B$633,2,FALSE)","v":10000},{"$f":"VLOOKUP(B512,'2022emp'!$A$2:$F$633,4,FALSE)","v":55000},{"$f":"VLOOKUP(B512,'2022emp'!$A$2:$H$633,7,FALSE)","v":10000},{"$f":"VLOOKUP(B512,'2022emp'!$A$2:$H$633,8,FALSE)","v":300},-30,18.181818181818183,"Very Manufacturing Dependent",18.2]
["South West","Somerton and Frome",5000,34000,14.705882352941178,395,370,360,35,25,"Sarah","Dyke","Liberal Democrat","Change","David","Warburton","Conservative",5000,450,"New MP","Sarah Dyke",null,"Manufacturing Dependent",13.513513513513514,13.5,13.5,390,{"$f":"VLOOKUP(B513,'2022emp'!$A$2:$B$633,2,FALSE)","v":6000},{"$f":"VLOOKUP(B513,'2022emp'!$A$2:$F$633,4,FALSE)","v":38000},{"$f":"VLOOKUP(B513,'2022emp'!$A$2:$H$633,7,FALSE)","v":5000},{"$f":"VLOOKUP(B513,'2022emp'!$A$2:$H$633,8,FALSE)","v":500},20,15.789473684210526,"Manufacturing Dependent",15.8]
["Northern Ireland","South Antrim",null,null,{"$error":"#DIV/0!"},260,250,255,5,10,"Paul","Girvan","DUP","Hold","Paul","Girvan","DUP",null,null,"Same MP","Paul Girvan",null,{"$error":"#DIV/0!"},12.842270836351593,12.8,12.8,240,{"$f":"VLOOKUP(B514,'2022emp'!$A$2:$B$633,2,FALSE)","v":{"$error":"#N/A"}},{"$f":"VLOOKUP(B514,'2022emp'!$A$2:$F$633,4,FALSE)","v":{"$error":"#N/A"}},{"$f":"VLOOKUP(B514,'2022emp'!$A$2:$H$633,7,FALSE)","v":{"$error":"#N/A"}},{"$f":"VLOOKUP(B514,'2022emp'!$A$2:$H$633,8,FALSE)","v":{"$error":"#N/A"}},-10,null,"Not Manufacturing Dependent",0]
["Eastern","South Basildon and East Thurrock",1750,32000,5.46875,200,205,190,10,-5,"Stephen","Metcalfe","Conservative","Hold","Stephen","Metcalfe","Conservative",1500,150,"Same MP","Stephen Metcalfe",null,"Not Manufacturing Dependent",4.838709677419355,4.8,4.8,190,{"$f":"VLOOKUP(B515,'2022emp'!$A$2:$B$633,2,FALSE)","v":1500},{"$f":"VLOOKUP(B515,'2022emp'!$A$2:$F$633,4,FALSE)","v":34000},{"$f":"VLOOKUP(B515,'2022emp'!$A$2:$H$633,7,FALSE)","v":1250},{"$f":"VLOOKUP(B515,'2022emp'!$A$2:$H$633,8,FALSE)","v":125},-15,4.4117647058823533,"Not Manufacturing Dependent",4.4000000000000004]
["Eastern","South Cambridgeshire",5000,72000,6.9444444444444446,325,330,320,5,-5,"Anthony","Browne","Conservative","Hold","Anthony","Browne","Conservative",4500,600,"Same MP","Anthony Browne",null,"Not Manufacturing Dependent",7.042253521126761,7,7,320,{"$f":"VLOOKUP(B516,'2022emp'!$A$2:$B$633,2,FALSE)","v":6000},{"$f":"VLOOKUP(B516,'2022emp'!$A$2:$F$633,4,FALSE)","v":72000},{"$f":"VLOOKUP(B516,'2022emp'!$A$2:$H$633,7,FALSE)","v":5000},{"$f":"VLOOKUP(B516,'2022emp'!$A$2:$H$633,8,FALSE)","v":500},-10,8.3333333333333321,"Not Manufacturing Dependent",8.3000000000000007]
["East Midlands","South Derbyshire",6000,31000,19.35483870967742,255,245,255,0,10,"Heather","Wheeler","Conservative","Hold","Heather","Wheeler","Conservative",6000,250,"Same MP","Heather Wheeler",null,"Very Manufacturing Dependent",21.875,21.9,21.9,235,{"$f":"VLOOKUP(B517,'2022emp'!$A$2:$B$633,2,FALSE)","v":6000},{"$f":"VLOOKUP(B517,'2022emp'!$A$2:$F$633,4,FALSE)","v":34000},{"$f":"VLOOKUP(B517,'2022emp'!$A$2:$H$633,7,FALSE)","v":6000},{"$f":"VLOOKUP(B517,'2022emp'!$A$2:$H$633,8,FALSE)","v":300},-10,17.647058823529413,"Manufacturing Dependent",17.600000000000001]
["South West","South Dorset",1750,28000,6.25,165,160,165,0,5,"Richard","Drax","Conservative","Hold","Richard","Drax","Conservative",1750,100,"Same MP","Richard Drax",null,"Not Manufacturing Dependent",5.1724137931034484,5.2,5.2,170,{"$f":"VLOOKUP(B518,'2022emp'!$A$2:$B$633,2,FALSE)","v":1750},{"$f":"VLOOKUP(B518,'2022emp'!$A$2:$F$633,4,FALSE)","v":30000},{"$f":"VLOOKUP(B518,'2022emp'!$A$2:$H$633,7,FALSE)","v":1750},{"$f":"VLOOKUP(B518,'2022emp'!$A$2:$H$633,8,FALSE)","v":125},10,5.833333333333333,"Not Manufacturing Dependent",5.8]
["Northern Ireland","South Down",null,null,{"$error":"#DIV/0!"},380,315,330,50,65,"Christopher","Hazzard","Sinn Fein","Hold","Christopher","Hazzard","Sinn Fein",null,null,"Same MP","Christopher Hazzard",null,{"$error":"#DIV/0!"},14.0761744731499,14.1,14.1,350,{"$f":"VLOOKUP(B519,'2022emp'!$A$2:$B$633,2,FALSE)","v":{"$error":"#N/A"}},{"$f":"VLOOKUP(B519,'2022emp'!$A$2:$F$633,4,FALSE)","v":{"$error":"#N/A"}},{"$f":"VLOOKUP(B519,'2022emp'!$A$2:$H$633,7,FALSE)","v":{"$error":"#N/A"}},{"$f":"VLOOKUP(B519,'2022emp'!$A$2:$H$633,8,FALSE)","v":{"$error":"#N/A"}},35,null,"Not Manufacturing Dependent",0]
["Eastern","South East Cambridgeshire",7000,63000,11.111111111111111,520,370,575,-55,150,"Lucy","Frazer","Conservative","Hold","Lucy","Frazer","Conservative",7000,600,"Same MP","Lucy Frazer",null,"Manufacturing Dependent",14.035087719298245,14,14,345,{"$f":"VLOOKUP(B520,'2022emp'!$A$2:$B$633,2,FALSE)","v":8000},{"$f":"VLOOKUP(B520,'2022emp'!$A$2:$F$633,4,FALSE)","v":61000},{"$f":"VLOOKUP(B520,'2022emp'!$A$2:$H$633,7,FALSE)","v":7000},{"$f":"VLOOKUP(B520,'2022emp'!$A$2:$H$633,8,FALSE)","v":600},-25,13.114754098360656,"Manufacturing Dependent",13.1]
["South West","South East Cornwall",2250,24000,9.375,210,200,195,{"$f":"F521-H521","v":15},{"$f":"F521-G521","v":10},"Sheryll","Murray","Conservative","Hold","Sheryll","Murray","Conservative",2000,200,"Same MP",{"$f":"CONCATENATE(K521,\" \",L521)","v":"Sheryll Murray"},null,{"$f":"IF(E521>24.29, \"Extremely Manufacturing Dependent\", IF(E521>16.59, \"Very Manufacturing Dependent\", IF(E521>8.09, \"Manufacturing Dependent\", \"Not Manufacturing Dependent\")))","v":"Manufacturing Dependent"},10.416666666666668,10.4,10.4,210,{"$f":"VLOOKUP(B521,'2022emp'!$A$2:$B$633,2,FALSE)","v":2500},{"$f":"VLOOKUP(B521,'2022emp'!$A$2:$F$633,4,FALSE)","v":27000},{"$f":"VLOOKUP(B521,'2022emp'!$A$2:$H$633,7,FALSE)","v":2250},{"$f":"VLOOKUP(B521,'2022emp'!$A$2:$H$633,8,FALSE)","v":300},10,9.2592592592592595,"Manufacturing Dependent",9.3000000000000007]
["East Midlands","South Holland and The Deepings",8000,40000,20,220,215,210,10,5,"John","Hayes","Conservative",{"$f":"IF(M522=Q522, \"Hold\", \"Change\")","v":"Hold"},"John","Hayes","Conservative",8000,400,{"$f":"IF(L522=P522, \"Same MP\", \"New MP\")","v":"Same MP"},"John Hayes",null,"Very Manufacturing Dependent",22.5,{"$f":"ROUND(X522,1)","v":22.5},22.5,240,{"$f":"VLOOKUP(B522,'2022emp'!$A$2:$B$633,2,FALSE)","v":7000},{"$f":"VLOOKUP(B522,'2022emp'!$A$2:$F$633,4,FALSE)","v":41000},{"$f":"VLOOKUP(B522,'2022emp'!$A$2:$H$633,7,FALSE)","v":7000},{"$f":"VLOOKUP(B522,'2022emp'!$A$2:$H$633,8,FALSE)","v":400},{"$f":"AA522-G522","v":25},{"$f":"(AB522/AC522)*100","v":17.073170731707318},{"$f":"IF(AG522>26.79, \"Extremely Manufacturing Dependent\", IF(AG522>17.86, \"Very Manufacturing Dependent\", IF(AG522>8.93, \"Manufacturing Dependent\", \"Not Manufacturing Dependent\")))","v":"Manufacturing Dependent"},{"$f":"ROUND(AG522,1)","v":17.100000000000001}]
["East Midlands","South Leicestershire",4000,66000,{"$f":"(C523/D523)*100","v":6.0606060606060606},340,335,345,-5,5,"Alberto","Costa","Conservative","Hold","Alberto","Costa","Conservative",3500,350,"Same MP","Alberto Costa",null,"Not Manufacturing Dependent",6.5217391304347823,6.5,6.5,315,{"$f":"VLOOKUP(B523,'2022emp'!$A$2:$B$633,2,FALSE)","v":5000},{"$f":"VLOOKUP(B523,'2022emp'!$A$2:$F$633,4,FALSE)","v":71000},{"$f":"VLOOKUP(B523,'2022emp'!$A$2:$H$633,7,FALSE)","v":4000},{"$f":"VLOOKUP(B523,'2022emp'!$A$2:$H$633,8,FALSE)","v":500},-20,7.042253521126761,"Not Manufacturing Dependent",7]
["Eastern","South Norfolk",3500,44000,7.9545454545454541,280,265,275,5,15,"Richard","Bacon","Conservative","Hold","Richard","Bacon","Conservative",3000,300,"Same MP","Richard Bacon",null,"Not Manufacturing Dependent",8.1395348837209305,8.1,8.1,265,{"$f":"VLOOKUP(B524,'2022emp'!$A$2:$B$633,2,FALSE)","v":4500},{"$f":"VLOOKUP(B524,'2022emp'!$A$2:$F$633,4,FALSE)","v":48000},{"$f":"VLOOKUP(B524,'2022emp'!$A$2:$H$633,7,FALSE)","v":4000},{"$f":"VLOOKUP(B524,'2022emp'!$A$2:$H$633,8,FALSE)","v":400},0,9.375,"Manufacturing Dependent",9.4]
["East Midlands","South Northamptonshire",3500,66000,5.3030303030303028,315,330,325,-10,-15,"Andrea","Leadsom","Conservative","Hold","Andrea","Leadsom","Conservative",3000,350,"Same MP","Andrea Leadsom",null,"Not Manufacturing Dependent",5.1470588235294112,5.0999999999999996,5.0999999999999996,300,{"$f":"VLOOKUP(B525,'2022emp'!$A$2:$B$633,2,FALSE)","v":3000},{"$f":"VLOOKUP(B525,'2022emp'!$A$2:$F$633,4,FALSE)","v":69000},{"$f":"VLOOKUP(B525,'2022emp'!$A$2:$H$633,7,FALSE)","v":3000},{"$f":"VLOOKUP(B525,'2022emp'!$A$2:$H$633,8,FALSE)","v":300},-30,4.3478260869565215,"Not Manufacturing Dependent",4.3]
["North West","South Ribble",4000,31000,12.903225806451612,210,225,220,-10,-15,"Katherine","Fletcher","Conservative","Hold","Katherine","Fletcher","Conservative",3500,400,"Same MP","Katherine Fletcher",null,"Manufacturing Dependent",10.344827586206897,10.3,10.3,210,{"$f":"VLOOKUP(B526,'2022emp'!$A$2:$B$633,2,FALSE)","v":4000},{"$f":"VLOOKUP(B526,'2022emp'!$A$2:$F$633,4,FALSE)","v":32000},{"$f":"VLOOKUP(B526,'2022emp'!$A$2:$H$633,7,FALSE)","v":3500},{"$f":"VLOOKUP(B526,'2022emp'!$A$2:$H$633,8,FALSE)","v":500},-15,12.5,"Manufacturing Dependent",12.5]
["North East","South Shields",1250,20000,6.25,140,130,130,10,10,"Emma","Lewell-Buck","Labour","Hold","Emma","Lewell-Buck","Labour",1250,125,"Same MP","Emma Lewell-Buck",null,"Not Manufacturing Dependent",7.1428571428571423,7.1,7.1,110,{"$f":"VLOOKUP(B527,'2022emp'!$A$2:$B$633,2,FALSE)","v":1000},{"$f":"VLOOKUP(B527,'2022emp'!$A$2:$F$633,4,FALSE)","v":20000},{"$f":"VLOOKUP(B527,'2022emp'!$A$2:$H$633,7,FALSE)","v":800},{"$f":"VLOOKUP(B527,'2022emp'!$A$2:$H$633,8,FALSE)","v":225},-20,5,"Not Manufacturing Dependent",5]
["West Midlands","South Staffordshire",4500,27000,16.666666666666664,230,230,230,0,0,"Gavin","Williamson","Conservative","Hold","Gavin","Williamson","Conservative",4000,300,"Same MP","Gavin Williamson",null,"Very Manufacturing Dependent",16.666666666666664,16.7,16.7,235,{"$f":"VLOOKUP(B528,'2022emp'!$A$2:$B$633,2,FALSE)","v":5000},{"$f":"VLOOKUP(B528,'2022emp'!$A$2:$F$633,4,FALSE)","v":31000},{"$f":"VLOOKUP(B528,'2022emp'!$A$2:$H$633,7,FALSE)","v":4500},{"$f":"VLOOKUP(B528,'2022emp'!$A$2:$H$633,8,FALSE)","v":600},5,16.129032258064516,"Manufacturing Dependent",16.100000000000001]
["Eastern","South Suffolk",4500,32000,14.0625,300,290,295,5,10,"James","Cartlidge","Conservative","Hold","James","Cartlidge","Conservative",4000,500,"Same MP","James Cartlidge",null,"Manufacturing Dependent",15.625,15.6,15.6,310,{"$f":"VLOOKUP(B529,'2022emp'!$A$2:$B$633,2,FALSE)","v":4500},{"$f":"VLOOKUP(B529,'2022emp'!$A$2:$F$633,4,FALSE)","v":33000},{"$f":"VLOOKUP(B529,'2022emp'!$A$2:$H$633,7,FALSE)","v":3500},{"$f":"VLOOKUP(B529,'2022emp'!$A$2:$H$633,8,FALSE)","v":600},20,13.636363636363635,"Manufacturing Dependent",13.6]
["South West","South Swindon",2500,63000,3.9682539682539679,140,135,130,10,5,"Robert","Buckland","Conservative","Hold","Robert","Buckland","Conservative",2500,125,"Same MP","Robert Buckland",null,"Not Manufacturing Dependent",3.90625,3.9,3.9,130,{"$f":"VLOOKUP(B530,'2022emp'!$A$2:$B$633,2,FALSE)","v":2500},{"$f":"VLOOKUP(B530,'2022emp'!$A$2:$F$633,4,FALSE)","v":62000},{"$f":"VLOOKUP(B530,'2022emp'!$A$2:$H$633,7,FALSE)","v":2500},{"$f":"VLOOKUP(B530,'2022emp'!$A$2:$H$633,8,FALSE)","v":150},-5,4.032258064516129,"Not Manufacturing Dependent",4]
["South East","South Thanet",2000,30000,6.666666666666667,195,180,190,5,15,"Craig","Mackinlay","Conservative","Hold","Craig","Mackinlay","Conservative",1750,350,"Same MP","Craig Mackinlay",null,"Not Manufacturing Dependent",7.2580645161290329,7.3,7.3,185,{"$f":"VLOOKUP(B531,'2022emp'!$A$2:$B$633,2,FALSE)","v":2000},{"$f":"VLOOKUP(B531,'2022emp'!$A$2:$F$633,4,FALSE)","v":31000},{"$f":"VLOOKUP(B531,'2022emp'!$A$2:$H$633,7,FALSE)","v":1750},{"$f":"VLOOKUP(B531,'2022emp'!$A$2:$H$633,8,FALSE)","v":300},5,6.4516129032258061,"Not Manufacturing Dependent",6.5]
["Eastern","South West Bedfordshire",5000,44000,11.363636363636363,310,310,310,0,0,"Andrew","Selous","Conservative","Hold","Andrew","Selous","Conservative",4500,400,"Same MP","Andrew Selous",null,"Manufacturing Dependent",12.5,12.5,12.5,275,{"$f":"VLOOKUP(B532,'2022emp'!$A$2:$B$633,2,FALSE)","v":6000},{"$f":"VLOOKUP(B532,'2022emp'!$A$2:$F$633,4,FALSE)","v":47000},{"$f":"VLOOKUP(B532,'2022emp'!$A$2:$H$633,7,FALSE)","v":5000},{"$f":"VLOOKUP(B532,'2022emp'!$A$2:$H$633,8,FALSE)","v":500},-35,12.76595744680851,"Manufacturing Dependent",12.8]
["South West","South West Devon",5000,31000,16.129032258064516,205,190,185,20,15,"Gary","Streeter","Conservative","Hold","Gary","Streeter","Conservative",4500,350,"Same MP","Gary Streeter",null,"Manufacturing Dependent",15.625,15.6,15.6,205,{"$f":"VLOOKUP(B533,'2022emp'!$A$2:$B$633,2,FALSE)","v":6000},{"$f":"VLOOKUP(B533,'2022emp'!$A$2:$F$633,4,FALSE)","v":32000},{"$f":"VLOOKUP(B533,'2022emp'!$A$2:$H$633,7,FALSE)","v":5000},{"$f":"VLOOKUP(B533,'2022emp'!$A$2:$H$633,8,FALSE)","v":350},15,18.75,"Very Manufacturing Dependent",18.8]
["Eastern","South West Hertfordshire",1500,48000,3.125,250,240,240,10,10,"Gagan","Mohindra","Conservative","Hold","Gagan","Mohindra","Conservative",1250,175,"Same MP","Gagan Mohindra",null,"Not Manufacturing Dependent",3.6458333333333335,3.6,3.6,235,{"$f":"VLOOKUP(B534,'2022emp'!$A$2:$B$633,2,FALSE)","v":1500},{"$f":"VLOOKUP(B534,'2022emp'!$A$2:$F$633,4,FALSE)","v":47000},{"$f":"VLOOKUP(B534,'2022emp'!$A$2:$H$633,7,FALSE)","v":1250},{"$f":"VLOOKUP(B534,'2022emp'!$A$2:$H$633,8,FALSE)","v":225},-5,3.1914893617021276,"Not Manufacturing Dependent",3.2]
["Eastern","South West Norfolk",6000,34000,17.647058823529413,300,290,290,10,10,"Elizabeth","Truss","Conservative","Hold","Elizabeth","Truss","Conservative",6000,450,"Same MP","Elizabeth Truss",null,"Very Manufacturing Dependent",17.647058823529413,17.600000000000001,17.600000000000001,290,{"$f":"VLOOKUP(B535,'2022emp'!$A$2:$B$633,2,FALSE)","v":7000},{"$f":"VLOOKUP(B535,'2022emp'!$A$2:$F$633,4,FALSE)","v":34000},{"$f":"VLOOKUP(B535,'2022emp'!$A$2:$H$633,7,FALSE)","v":6000},{"$f":"VLOOKUP(B535,'2022emp'!$A$2:$H$633,8,FALSE)","v":600},0,20.588235294117645,"Very Manufacturing Dependent",20.6]
["South East","South West Surrey",2000,45000,4.4444444444444446,235,230,230,5,5,"Jeremy","Hunt","Conservative","Hold","Jeremy","Hunt","Conservative",1750,250,"Same MP","Jeremy Hunt",null,"Not Manufacturing Dependent",3.4090909090909087,3.4,3.4,210,{"$f":"VLOOKUP(B536,'2022emp'!$A$2:$B$633,2,FALSE)","v":1250},{"$f":"VLOOKUP(B536,'2022emp'!$A$2:$F$633,4,FALSE)","v":46000},{"$f":"VLOOKUP(B536,'2022emp'!$A$2:$H$633,7,FALSE)","v":1000},{"$f":"VLOOKUP(B536,'2022emp'!$A$2:$H$633,8,FALSE)","v":175},-20,2.7173913043478262,"Not Manufacturing Dependent",2.7]
["South West","South West Wiltshire",4500,41000,10.975609756097562,250,240,255,-5,10,"Andrew","Murrison","Conservative","Hold","Andrew","Murrison","Conservative",4000,300,"Same MP","Andrew Murrison",null,"Manufacturing Dependent",11.111111111111111,11.1,11.1,230,{"$f":"VLOOKUP(B537,'2022emp'!$A$2:$B$633,2,FALSE)","v":4500},{"$f":"VLOOKUP(B537,'2022emp'!$A$2:$F$633,4,FALSE)","v":42000},{"$f":"VLOOKUP(B537,'2022emp'!$A$2:$H$633,7,FALSE)","v":4500},{"$f":"VLOOKUP(B537,'2022emp'!$A$2:$H$633,8,FALSE)","v":400},-10,10.714285714285714,"Manufacturing Dependent",10.7]
["South East","Southampton, Itchen",1750,47000,3.7234042553191489,200,235,175,25,-35,"Royston","Smith","Conservative","Hold","Royston","Smith","Conservative",1500,250,"Same MP","Royston Smith",null,"Not Manufacturing Dependent",3.5000000000000004,3.5,3.5,175,{"$f":"VLOOKUP(B538,'2022emp'!$A$2:$B$633,2,FALSE)","v":1750},{"$f":"VLOOKUP(B538,'2022emp'!$A$2:$F$633,4,FALSE)","v":50000},{"$f":"VLOOKUP(B538,'2022emp'!$A$2:$H$633,7,FALSE)","v":1500},{"$f":"VLOOKUP(B538,'2022emp'!$A$2:$H$633,8,FALSE)","v":225},-60,3.5000000000000004,"Not Manufacturing Dependent",3.5]
["South East","Southampton, Test",2000,57000,3.5087719298245612,170,170,175,-5,0,"Alan","Whitehead","Labour","Hold","Alan","Whitehead","Labour",1750,225,"Same MP","Alan Whitehead",null,"Not Manufacturing Dependent",2.9166666666666665,2.9,2.9,150,{"$f":"VLOOKUP(B539,'2022emp'!$A$2:$B$633,2,FALSE)","v":2250},{"$f":"VLOOKUP(B539,'2022emp'!$A$2:$F$633,4,FALSE)","v":58000},{"$f":"VLOOKUP(B539,'2022emp'!$A$2:$H$633,7,FALSE)","v":2000},{"$f":"VLOOKUP(B539,'2022emp'!$A$2:$H$633,8,FALSE)","v":250},-20,3.8793103448275863,"Not Manufacturing Dependent",3.9]
["Eastern","Southend West",700,28000,2.5,155,165,160,-5,-10,"Anna","Firth","Conservative","Hold","David","Amess","Conservative",600,75,"New MP","Anna Firth",null,"Not Manufacturing Dependent",3.214285714285714,3.2,3.2,135,{"$f":"VLOOKUP(B540,'2022emp'!$A$2:$B$633,2,FALSE)","v":700},{"$f":"VLOOKUP(B540,'2022emp'!$A$2:$F$633,4,FALSE)","v":28000},{"$f":"VLOOKUP(B540,'2022emp'!$A$2:$H$633,7,FALSE)","v":600},{"$f":"VLOOKUP(B540,'2022emp'!$A$2:$H$633,8,FALSE)","v":125},-30,2.5,"Not Manufacturing Dependent",2.5]
["North West","Southport",1000,31000,3.225806451612903,125,125,125,0,0,"Damien","Moore","Conservative","Hold","Damien","Moore","Conservative",900,125,"Same MP","Damien Moore",null,"Not Manufacturing Dependent",4.032258064516129,4,4,130,{"$f":"VLOOKUP(B541,'2022emp'!$A$2:$B$633,2,FALSE)","v":1000},{"$f":"VLOOKUP(B541,'2022emp'!$A$2:$F$633,4,FALSE)","v":31000},{"$f":"VLOOKUP(B541,'2022emp'!$A$2:$H$633,7,FALSE)","v":1000},{"$f":"VLOOKUP(B541,'2022emp'!$A$2:$H$633,8,FALSE)","v":125},5,3.225806451612903,"Not Manufacturing Dependent",3.2]
["South East","Spelthorne",1250,37000,3.3783783783783785,150,155,150,0,-5,"Kwasi","Kwarteng","Conservative","Hold","Kwasi","Kwarteng","Conservative",1250,150,"Same MP","Kwasi Kwarteng",null,"Not Manufacturing Dependent",4.0540540540540544,4.0999999999999996,4.0999999999999996,165,{"$f":"VLOOKUP(B542,'2022emp'!$A$2:$B$633,2,FALSE)","v":1500},{"$f":"VLOOKUP(B542,'2022emp'!$A$2:$F$633,4,FALSE)","v":40000},{"$f":"VLOOKUP(B542,'2022emp'!$A$2:$H$633,7,FALSE)","v":1250},{"$f":"VLOOKUP(B542,'2022emp'!$A$2:$H$633,8,FALSE)","v":225},10,3.75,"Not Manufacturing Dependent",3.8]
["Eastern","St Albans",1750,53000,3.3018867924528301,250,275,285,-35,-25,"Daisy","Cooper","Liberal Democrat","Hold","Daisy","Cooper","Liberal Democrat",1500,300,"Same MP","Daisy Cooper",null,"Not Manufacturing Dependent",3.8461538461538463,3.8,3.8,205,{"$f":"VLOOKUP(B543,'2022emp'!$A$2:$B$633,2,FALSE)","v":1500},{"$f":"VLOOKUP(B543,'2022emp'!$A$2:$F$633,4,FALSE)","v":51000},{"$f":"VLOOKUP(B543,'2022emp'!$A$2:$H$633,7,FALSE)","v":1250},{"$f":"VLOOKUP(B543,'2022emp'!$A$2:$H$633,8,FALSE)","v":300},-70,2.9411764705882351,"Not Manufacturing Dependent",2.9]
["South West","St Austell and Newquay",2500,37000,6.756756756756757,235,205,205,30,30,"Steve","Double","Conservative","Hold","Steve","Double","Conservative",2250,225,"Same MP","Steve Double",null,"Not Manufacturing Dependent",6.756756756756757,6.8,6.8,235,{"$f":"VLOOKUP(B544,'2022emp'!$A$2:$B$633,2,FALSE)","v":2500},{"$f":"VLOOKUP(B544,'2022emp'!$A$2:$F$633,4,FALSE)","v":40000},{"$f":"VLOOKUP(B544,'2022emp'!$A$2:$H$633,7,FALSE)","v":2250},{"$f":"VLOOKUP(B544,'2022emp'!$A$2:$H$633,8,FALSE)","v":225},30,6.25,"Not Manufacturing Dependent",6.3]
["North West","St Helens North",2000,28000,7.1428571428571423,140,135,145,-5,5,"Conor","McGinn","Independent","Change","Conor","McGinn","Labour",1750,175,"Same MP","Conor McGinn",null,"Not Manufacturing Dependent",8.6206896551724146,8.6,8.6,145,{"$f":"VLOOKUP(B545,'2022emp'!$A$2:$B$633,2,FALSE)","v":2500},{"$f":"VLOOKUP(B545,'2022emp'!$A$2:$F$633,4,FALSE)","v":32000},{"$f":"VLOOKUP(B545,'2022emp'!$A$2:$H$633,7,FALSE)","v":2250},{"$f":"VLOOKUP(B545,'2022emp'!$A$2:$H$633,8,FALSE)","v":225},10,7.8125,"Not Manufacturing Dependent",7.8]
["North West","St Helens South and Whiston",4000,46000,8.695652173913043,190,175,175,15,15,"Marie","Rimmer","Labour","Hold","Marie","Rimmer","Labour",3000,500,"Same MP","Marie Rimmer",null,"Manufacturing Dependent",8.8888888888888893,8.9,8.9,175,{"$f":"VLOOKUP(B546,'2022emp'!$A$2:$B$633,2,FALSE)","v":4000},{"$f":"VLOOKUP(B546,'2022emp'!$A$2:$F$633,4,FALSE)","v":55000},{"$f":"VLOOKUP(B546,'2022emp'!$A$2:$H$633,7,FALSE)","v":3500},{"$f":"VLOOKUP(B546,'2022emp'!$A$2:$H$633,8,FALSE)","v":350},0,7.2727272727272725,"Not Manufacturing Dependent",7.3]
["South West","St Ives",1250,27000,4.6296296296296298,210,190,200,10,20,"Derek","Thomas","Conservative","Hold","Derek","Thomas","Conservative",900,350,"Same MP","Derek Thomas",null,"Not Manufacturing Dependent",4.4642857142857144,4.5,4.5,195,{"$f":"VLOOKUP(B547,'2022emp'!$A$2:$B$633,2,FALSE)","v":1250},{"$f":"VLOOKUP(B547,'2022emp'!$A$2:$F$633,4,FALSE)","v":30000},{"$f":"VLOOKUP(B547,'2022emp'!$A$2:$H$633,7,FALSE)","v":1250},{"$f":"VLOOKUP(B547,'2022emp'!$A$2:$H$633,8,FALSE)","v":175},5,4.1666666666666661,"Not Manufacturing Dependent",4.2]
["West Midlands","Stafford",5000,48000,10.416666666666668,195,195,190,5,0,"Theo","Clarke","Conservative","Hold","Theo","Clarke","Conservative",4500,300,"Same MP","Theo Clarke",null,"Manufacturing Dependent",10.416666666666668,10.4,10.4,190,{"$f":"VLOOKUP(B548,'2022emp'!$A$2:$B$633,2,FALSE)","v":4500},{"$f":"VLOOKUP(B548,'2022emp'!$A$2:$F$633,4,FALSE)","v":48000},{"$f":"VLOOKUP(B548,'2022emp'!$A$2:$H$633,7,FALSE)","v":4000},{"$f":"VLOOKUP(B548,'2022emp'!$A$2:$H$633,8,FALSE)","v":300},-5,9.375,"Manufacturing Dependent",9.4]
["West Midlands","Staffordshire Moorlands",3000,22000,13.636363636363635,220,210,215,5,10,"Karen","Bradley","Conservative","Hold","Karen","Bradley","Conservative",2500,300,"Same MP","Karen Bradley",null,"Manufacturing Dependent",16.666666666666664,16.7,16.7,220,{"$f":"VLOOKUP(B549,'2022emp'!$A$2:$B$633,2,FALSE)","v":2500},{"$f":"VLOOKUP(B549,'2022emp'!$A$2:$F$633,4,FALSE)","v":23000},{"$f":"VLOOKUP(B549,'2022emp'!$A$2:$H$633,7,FALSE)","v":2500},{"$f":"VLOOKUP(B549,'2022emp'!$A$2:$H$633,8,FALSE)","v":300},10,10.869565217391305,"Manufacturing Dependent",10.9]
["North West","Stalybridge and Hyde",3500,21000,16.666666666666664,285,275,290,-5,10,"Jonathan","Reynolds","Labour/Co-operative","Hold","Jonathan","Reynolds","Labour/Co-operative",3000,400,"Same MP","Jonathan Reynolds",null,"Very Manufacturing Dependent",13.636363636363635,13.6,13.6,255,{"$f":"VLOOKUP(B550,'2022emp'!$A$2:$B$633,2,FALSE)","v":3000},{"$f":"VLOOKUP(B550,'2022emp'!$A$2:$F$633,4,FALSE)","v":22000},{"$f":"VLOOKUP(B550,'2022emp'!$A$2:$H$633,7,FALSE)","v":2500},{"$f":"VLOOKUP(B550,'2022emp'!$A$2:$H$633,8,FALSE)","v":500},-20,13.636363636363635,"Manufacturing Dependent",13.6]
["Eastern","Stevenage",5000,50000,10,180,175,165,15,5,"Stephen","McPartland","Conservative","Hold","Stephen","McPartland","Conservative",5000,350,"Same MP","Stephen McPartland",null,"Manufacturing Dependent",12.5,12.5,12.5,190,{"$f":"VLOOKUP(B551,'2022emp'!$A$2:$B$633,2,FALSE)","v":6000},{"$f":"VLOOKUP(B551,'2022emp'!$A$2:$F$633,4,FALSE)","v":54000},{"$f":"VLOOKUP(B551,'2022emp'!$A$2:$H$633,7,FALSE)","v":5000},{"$f":"VLOOKUP(B551,'2022emp'!$A$2:$H$633,8,FALSE)","v":350},15,11.111111111111111,"Manufacturing Dependent",11.1]
["Scotland","Stirling",3000,46000,6.5217391304347823,155,135,150,5,20,"Alyn","Smith","Scottish National Party","Hold","Alyn","Smith","Scottish National Party",2500,250,"Same MP","Alyn Smith",null,"Not Manufacturing Dependent",5.4347826086956523,5.4,5.4,155,{"$f":"VLOOKUP(B552,'2022emp'!$A$2:$B$633,2,FALSE)","v":2500},{"$f":"VLOOKUP(B552,'2022emp'!$A$2:$F$633,4,FALSE)","v":47000},{"$f":"VLOOKUP(B552,'2022emp'!$A$2:$H$633,7,FALSE)","v":2250},{"$f":"VLOOKUP(B552,'2022emp'!$A$2:$H$633,8,FALSE)","v":225},20,5.3191489361702127,"Not Manufacturing Dependent",5.3]
["North West","Stockport",4500,60000,7.5,230,245,245,-15,-15,"Navendu","Mishra","Labour","Hold","Navendu","Mishra","Labour",3500,700,"Same MP","Navendu Mishra",null,"Not Manufacturing Dependent",7.9365079365079358,7.9,7.9,220,{"$f":"VLOOKUP(B553,'2022emp'!$A$2:$B$633,2,FALSE)","v":3500},{"$f":"VLOOKUP(B553,'2022emp'!$A$2:$F$633,4,FALSE)","v":55000},{"$f":"VLOOKUP(B553,'2022emp'!$A$2:$H$633,7,FALSE)","v":3000},{"$f":"VLOOKUP(B553,'2022emp'!$A$2:$H$633,8,FALSE)","v":350},-25,6.3636363636363633,"Not Manufacturing Dependent",6.4]
["North East","Stockton North",5000,45000,11.111111111111111,170,170,165,5,0,"Alex","Cunningham","Labour","Hold","Alex","Cunningham","Labour",4500,700,"Same MP","Alex Cunningham",null,"Manufacturing Dependent",13.043478260869565,13,13,145,{"$f":"VLOOKUP(B554,'2022emp'!$A$2:$B$633,2,FALSE)","v":7000},{"$f":"VLOOKUP(B554,'2022emp'!$A$2:$F$633,4,FALSE)","v":45000},{"$f":"VLOOKUP(B554,'2022emp'!$A$2:$H$633,7,FALSE)","v":6000},{"$f":"VLOOKUP(B554,'2022emp'!$A$2:$H$633,8,FALSE)","v":700},-25,15.555555555555555,"Manufacturing Dependent",15.6]
["North East","Stockton South",5000,40000,12.5,170,180,175,-5,-10,"Matt","Vickers","Conservative","Hold","Matt","Vickers","Conservative",5000,300,"Same MP","Matt Vickers",null,"Manufacturing Dependent",8.1081081081081088,8.1,8.1,130,{"$f":"VLOOKUP(B555,'2022emp'!$A$2:$B$633,2,FALSE)","v":3500},{"$f":"VLOOKUP(B555,'2022emp'!$A$2:$F$633,4,FALSE)","v":36000},{"$f":"VLOOKUP(B555,'2022emp'!$A$2:$H$633,7,FALSE)","v":3000},{"$f":"VLOOKUP(B555,'2022emp'!$A$2:$H$633,8,FALSE)","v":500},-50,9.7222222222222232,"Manufacturing Dependent",9.6999999999999993]
["West Midlands","Stoke-on-Trent Central",4000,66000,6.0606060606060606,170,170,165,5,0,"Jo","Gideon","Conservative","Hold","Jo","Gideon","Conservative",3500,500,"Same MP","Jo Gideon",null,"Not Manufacturing Dependent",7.2463768115942031,7.2,7.2,175,{"$f":"VLOOKUP(B556,'2022emp'!$A$2:$B$633,2,FALSE)","v":6000},{"$f":"VLOOKUP(B556,'2022emp'!$A$2:$F$633,4,FALSE)","v":69000},{"$f":"VLOOKUP(B556,'2022emp'!$A$2:$H$633,7,FALSE)","v":5000},{"$f":"VLOOKUP(B556,'2022emp'!$A$2:$H$633,8,FALSE)","v":700},5,8.695652173913043,"Not Manufacturing Dependent",8.6999999999999993]
["West Midlands","Stoke-on-Trent North",5000,27000,18.518518518518519,240,255,245,-5,-15,"Jonathan","Gullis","Conservative","Hold","Jonathan Edward","Gullis","Conservative",4500,700,"Same MP","Jonathan Gullis",null,"Very Manufacturing Dependent",18.518518518518519,18.5,18.5,235,{"$f":"VLOOKUP(B557,'2022emp'!$A$2:$B$633,2,FALSE)","v":6000},{"$f":"VLOOKUP(B557,'2022emp'!$A$2:$F$633,4,FALSE)","v":27000},{"$f":"VLOOKUP(B557,'2022emp'!$A$2:$H$633,7,FALSE)","v":5000},{"$f":"VLOOKUP(B557,'2022emp'!$A$2:$H$633,8,FALSE)","v":600},-20,22.222222222222221,"Very Manufacturing Dependent",22.2]
["West Midlands","Stoke-on-Trent South",4500,29000,15.517241379310345,180,200,195,-15,-20,"Jack","Brereton","Conservative","Hold","Jack Edgar","Brereton","Conservative",4500,350,"Same MP","Jack Brereton",null,"Manufacturing Dependent",17.241379310344829,17.2,17.2,190,{"$f":"VLOOKUP(B558,'2022emp'!$A$2:$B$633,2,FALSE)","v":6000},{"$f":"VLOOKUP(B558,'2022emp'!$A$2:$F$633,4,FALSE)","v":32000},{"$f":"VLOOKUP(B558,'2022emp'!$A$2:$H$633,7,FALSE)","v":5000},{"$f":"VLOOKUP(B558,'2022emp'!$A$2:$H$633,8,FALSE)","v":700},-10,18.75,"Very Manufacturing Dependent",18.8]
["West Midlands","Stone",4000,26000,15.384615384615385,240,240,245,-5,0,"Bill","Cash","Conservative","Hold","Bill","Cash","Conservative",4000,300,"Same MP","Bill Cash",null,"Manufacturing Dependent",17.307692307692307,17.3,17.3,230,{"$f":"VLOOKUP(B559,'2022emp'!$A$2:$B$633,2,FALSE)","v":4000},{"$f":"VLOOKUP(B559,'2022emp'!$A$2:$F$633,4,FALSE)","v":27000},{"$f":"VLOOKUP(B559,'2022emp'!$A$2:$H$633,7,FALSE)","v":3500},{"$f":"VLOOKUP(B559,'2022emp'!$A$2:$H$633,8,FALSE)","v":600},-10,14.814814814814813,"Manufacturing Dependent",14.8]
["West Midlands","Stourbridge",3500,21000,16.666666666666664,280,305,300,-20,-25,"Suzanne","Webb","Conservative","Hold","Suzanne","Webb","Conservative",3000,350,"Same MP","Suzanne Webb",null,"Very Manufacturing Dependent",15.217391304347828,15.2,15.2,270,{"$f":"VLOOKUP(B560,'2022emp'!$A$2:$B$633,2,FALSE)","v":3500},{"$f":"VLOOKUP(B560,'2022emp'!$A$2:$F$633,4,FALSE)","v":22000},{"$f":"VLOOKUP(B560,'2022emp'!$A$2:$H$633,7,FALSE)","v":3000},{"$f":"VLOOKUP(B560,'2022emp'!$A$2:$H$633,8,FALSE)","v":400},-35,15.909090909090908,"Manufacturing Dependent",15.9]
["Northern Ireland","Strangford",null,null,{"$error":"#DIV/0!"},260,245,250,10,15,"Jim","Shannon","DUP","Hold","Jim","Shannon","DUP",null,null,"Same MP","Jim Shannon",null,{"$error":"#DIV/0!"},10.722429991790568,10.7,10.7,245,{"$f":"VLOOKUP(B561,'2022emp'!$A$2:$B$633,2,FALSE)","v":{"$error":"#N/A"}},{"$f":"VLOOKUP(B561,'2022emp'!$A$2:$F$633,4,FALSE)","v":{"$error":"#N/A"}},{"$f":"VLOOKUP(B561,'2022emp'!$A$2:$H$633,7,FALSE)","v":{"$error":"#N/A"}},{"$f":"VLOOKUP(B561,'2022emp'!$A$2:$H$633,8,FALSE)","v":{"$error":"#N/A"}},0,null,"Not Manufacturing Dependent",0]
["West Midlands","Stratford-on-Avon",2500,47000,5.3191489361702127,330,320,330,0,10,"Nadhim","Zahawi","Conservative","Hold","Nadhim","Zahawi","Conservative",2250,300,"Same MP","Nadhim Zahawi",null,"Not Manufacturing Dependent",6.5217391304347823,6.5,6.5,335,{"$f":"VLOOKUP(B562,'2022emp'!$A$2:$B$633,2,FALSE)","v":3000},{"$f":"VLOOKUP(B562,'2022emp'!$A$2:$F$633,4,FALSE)","v":51000},{"$f":"VLOOKUP(B562,'2022emp'!$A$2:$H$633,7,FALSE)","v":2500},{"$f":"VLOOKUP(B562,'2022emp'!$A$2:$H$633,8,FALSE)","v":500},15,5.8823529411764701,"Not Manufacturing Dependent",5.9]
["London","Streatham",200,21000,0.95238095238095244,75,85,75,0,-10,"Bell","Ribeiro-Addy","Labour","Hold","Bell","Ribeiro-Addy","Labour",150,50,"Same MP","Bell Ribeiro-Addy",null,"Not Manufacturing Dependent",0.8,0.8,0.8,80,{"$f":"VLOOKUP(B563,'2022emp'!$A$2:$B$633,2,FALSE)","v":250},{"$f":"VLOOKUP(B563,'2022emp'!$A$2:$F$633,4,FALSE)","v":24000},{"$f":"VLOOKUP(B563,'2022emp'!$A$2:$H$633,7,FALSE)","v":175},{"$f":"VLOOKUP(B563,'2022emp'!$A$2:$H$633,8,FALSE)","v":50},-5,1.0416666666666665,"Not Manufacturing Dependent",1]
["North West","Stretford and Urmston",7000,85000,8.235294117647058,210,200,215,-5,10,"Andrew","Western","Labour","Hold","Kate","Green","Labour",6000,500,"New MP","Andrew Western",null,"Manufacturing Dependent",7.7777777777777777,7.8,7.8,200,{"$f":"VLOOKUP(B564,'2022emp'!$A$2:$B$633,2,FALSE)","v":7000},{"$f":"VLOOKUP(B564,'2022emp'!$A$2:$F$633,4,FALSE)","v":85000},{"$f":"VLOOKUP(B564,'2022emp'!$A$2:$H$633,7,FALSE)","v":6000},{"$f":"VLOOKUP(B564,'2022emp'!$A$2:$H$633,8,FALSE)","v":700},0,8.235294117647058,"Not Manufacturing Dependent",8.1999999999999993]
["South West","Stroud",8000,43000,18.604651162790699,370,355,340,30,15,"Siobhan","Baillie","Conservative","Hold","Siobhan","Baillie","Conservative",7000,700,"Same MP","Siobhan Baillie",null,"Very Manufacturing Dependent",18.181818181818183,18.2,18.2,365,{"$f":"VLOOKUP(B565,'2022emp'!$A$2:$B$633,2,FALSE)","v":9000},{"$f":"VLOOKUP(B565,'2022emp'!$A$2:$F$633,4,FALSE)","v":43000},{"$f":"VLOOKUP(B565,'2022emp'!$A$2:$H$633,7,FALSE)","v":8000},{"$f":"VLOOKUP(B565,'2022emp'!$A$2:$H$633,8,FALSE)","v":1000},10,20.930232558139537,"Very Manufacturing Dependent",20.9]
["Eastern","Suffolk Coastal",3500,48000,7.291666666666667,220,215,220,0,5,"Therese","Coffey","Conservative","Hold","Therese","Coffey","Conservative",3000,350,"Same MP","Therese Coffey",null,"Not Manufacturing Dependent",8.5106382978723403,8.5,8.5,230,{"$f":"VLOOKUP(B566,'2022emp'!$A$2:$B$633,2,FALSE)","v":3500},{"$f":"VLOOKUP(B566,'2022emp'!$A$2:$F$633,4,FALSE)","v":50000},{"$f":"VLOOKUP(B566,'2022emp'!$A$2:$H$633,7,FALSE)","v":3000},{"$f":"VLOOKUP(B566,'2022emp'!$A$2:$H$633,8,FALSE)","v":500},15,7.0000000000000009,"Not Manufacturing Dependent",7]
["North East","Sunderland Central",2250,48000,4.6875,145,155,145,0,-10,"Julie","Elliott","Labour","Hold","Julie","Elliott","Labour",2000,175,"Same MP","Julie Elliott",null,"Not Manufacturing Dependent",7.1428571428571423,7.1,7.1,135,{"$f":"VLOOKUP(B567,'2022emp'!$A$2:$B$633,2,FALSE)","v":2000},{"$f":"VLOOKUP(B567,'2022emp'!$A$2:$F$633,4,FALSE)","v":48000},{"$f":"VLOOKUP(B567,'2022emp'!$A$2:$H$633,7,FALSE)","v":1750},{"$f":"VLOOKUP(B567,'2022emp'!$A$2:$H$633,8,FALSE)","v":300},-20,4.1666666666666661,"Not Manufacturing Dependent",4.2]
["South East","Surrey Heath",4000,54000,7.4074074074074066,230,230,230,0,0,"Michael","Gove","Conservative","Hold","Michael","Gove","Conservative",3500,400,"Same MP","Michael Gove",null,"Not Manufacturing Dependent",6.666666666666667,6.7,6.7,220,{"$f":"VLOOKUP(B568,'2022emp'!$A$2:$B$633,2,FALSE)","v":3500},{"$f":"VLOOKUP(B568,'2022emp'!$A$2:$F$633,4,FALSE)","v":50000},{"$f":"VLOOKUP(B568,'2022emp'!$A$2:$H$633,7,FALSE)","v":3000},{"$f":"VLOOKUP(B568,'2022emp'!$A$2:$H$633,8,FALSE)","v":450},-10,7.0000000000000009,"Not Manufacturing Dependent",7]
["London","Sutton and Cheam",450,36000,1.25,125,120,115,10,5,"Paul","Scully","Conservative","Hold","Paul","Scully","Conservative",400,50,"Same MP","Paul Scully",null,"Not Manufacturing Dependent",1.7142857142857144,1.7,1.7,115,{"$f":"VLOOKUP(B569,'2022emp'!$A$2:$B$633,2,FALSE)","v":450},{"$f":"VLOOKUP(B569,'2022emp'!$A$2:$F$633,4,FALSE)","v":53000},{"$f":"VLOOKUP(B569,'2022emp'!$A$2:$H$633,7,FALSE)","v":400},{"$f":"VLOOKUP(B569,'2022emp'!$A$2:$H$633,8,FALSE)","v":50},-5,0.84905660377358494,"Not Manufacturing Dependent",0.8]
["West Midlands","Sutton Coldfield",1750,36000,4.8611111111111116,155,155,155,0,0,"Andrew","Mitchell","Conservative","Hold","Andrew","Mitchell","Conservative",1500,150,"Same MP","Andrew Mitchell",null,"Not Manufacturing Dependent",3.9473684210526314,3.9,3.9,140,{"$f":"VLOOKUP(B570,'2022emp'!$A$2:$B$633,2,FALSE)","v":1750},{"$f":"VLOOKUP(B570,'2022emp'!$A$2:$F$633,4,FALSE)","v":36000},{"$f":"VLOOKUP(B570,'2022emp'!$A$2:$H$633,7,FALSE)","v":1500},{"$f":"VLOOKUP(B570,'2022emp'!$A$2:$H$633,8,FALSE)","v":225},-15,4.8611111111111116,"Not Manufacturing Dependent",4.9000000000000004]
["Wales","Swansea East",2500,47000,5.3191489361702127,115,120,125,-10,-5,"Carolyn","Harris","Labour","Hold","Carolyn","Harris","Labour",2250,150,"Same MP","Carolyn Harris",null,"Not Manufacturing Dependent",5.3191489361702127,5.3,5.3,120,{"$f":"VLOOKUP(B571,'2022emp'!$A$2:$B$633,2,FALSE)","v":3000},{"$f":"VLOOKUP(B571,'2022emp'!$A$2:$F$633,4,FALSE)","v":49000},{"$f":"VLOOKUP(B571,'2022emp'!$A$2:$H$633,7,FALSE)","v":2500},{"$f":"VLOOKUP(B571,'2022emp'!$A$2:$H$633,8,FALSE)","v":125},0,6.1224489795918364,"Not Manufacturing Dependent",6.1]
["Wales","Swansea West",1250,40000,3.125,100,115,110,-10,-15,"Geraint","Davies","Independent","Change","Geraint","Davies","Labour",1250,100,"Same MP","Geraint Davies",null,"Not Manufacturing Dependent",2.8409090909090908,2.8,2.8,100,{"$f":"VLOOKUP(B572,'2022emp'!$A$2:$B$633,2,FALSE)","v":1000},{"$f":"VLOOKUP(B572,'2022emp'!$A$2:$F$633,4,FALSE)","v":41000},{"$f":"VLOOKUP(B572,'2022emp'!$A$2:$H$633,7,FALSE)","v":1000},{"$f":"VLOOKUP(B572,'2022emp'!$A$2:$H$633,8,FALSE)","v":125},-15,2.4390243902439024,"Not Manufacturing Dependent",2.4]
["West Midlands","Tamworth",5000,38000,13.157894736842104,275,290,295,-20,-15,"Sarah","Edwards","Labour","Change","Christopher","Pincher","Conservative",4500,450,"New MP","Sarah Edwards",null,"Manufacturing Dependent",13.157894736842104,13.2,13.2,250,{"$f":"VLOOKUP(B573,'2022emp'!$A$2:$B$633,2,FALSE)","v":5000},{"$f":"VLOOKUP(B573,'2022emp'!$A$2:$F$633,4,FALSE)","v":38000},{"$f":"VLOOKUP(B573,'2022emp'!$A$2:$H$633,7,FALSE)","v":4000},{"$f":"VLOOKUP(B573,'2022emp'!$A$2:$H$633,8,FALSE)","v":600},-40,13.157894736842104,"Manufacturing Dependent",13.2]
["North West","Tatton",4000,67000,5.9701492537313428,225,215,210,15,10,"Esther","McVey","Conservative","Hold","Esther","McVey","Conservative",3500,500,"Same MP","Esther McVey",null,"Not Manufacturing Dependent",6.1538461538461542,6.2,6.2,215,{"$f":"VLOOKUP(B574,'2022emp'!$A$2:$B$633,2,FALSE)","v":4000},{"$f":"VLOOKUP(B574,'2022emp'!$A$2:$F$633,4,FALSE)","v":58000},{"$f":"VLOOKUP(B574,'2022emp'!$A$2:$H$633,7,FALSE)","v":4000},{"$f":"VLOOKUP(B574,'2022emp'!$A$2:$H$633,8,FALSE)","v":400},0,6.8965517241379306,"Not Manufacturing Dependent",6.9]
["South West","Taunton Deane",3000,56000,5.3571428571428568,425,240,245,180,185,"Rebecca","Pow","Conservative","Hold","Rebecca","Pow","Conservative",3000,400,"Same MP","Rebecca Pow",null,"Not Manufacturing Dependent",6.25,6.3,6.3,235,{"$f":"VLOOKUP(B575,'2022emp'!$A$2:$B$633,2,FALSE)","v":3000},{"$f":"VLOOKUP(B575,'2022emp'!$A$2:$F$633,4,FALSE)","v":56000},{"$f":"VLOOKUP(B575,'2022emp'!$A$2:$H$633,7,FALSE)","v":2500},{"$f":"VLOOKUP(B575,'2022emp'!$A$2:$H$633,8,FALSE)","v":400},-5,5.3571428571428568,"Not Manufacturing Dependent",5.4]
["West Midlands","Telford",10000,54000,18.518518518518519,565,300,300,265,265,"Lucy","Allan","Conservative","Hold","Lucy","Allan","Conservative",9000,900,"Same MP","Lucy Allan",null,"Very Manufacturing Dependent",18.518518518518519,18.5,18.5,330,{"$f":"VLOOKUP(B576,'2022emp'!$A$2:$B$633,2,FALSE)","v":11000},{"$f":"VLOOKUP(B576,'2022emp'!$A$2:$F$633,4,FALSE)","v":59000},{"$f":"VLOOKUP(B576,'2022emp'!$A$2:$H$633,7,FALSE)","v":10000},{"$f":"VLOOKUP(B576,'2022emp'!$A$2:$H$633,8,FALSE)","v":900},30,18.64406779661017,"Very Manufacturing Dependent",18.600000000000001]
["South West","Tewkesbury",11000,57000,19.298245614035086,295,285,295,0,10,"Laurence","Robertson","Conservative","Hold","Laurence","Robertson","Conservative",10000,600,"Same MP","Laurence Robertson",null,"Very Manufacturing Dependent",20.37037037037037,20.399999999999999,20.399999999999999,285,{"$f":"VLOOKUP(B577,'2022emp'!$A$2:$B$633,2,FALSE)","v":11000},{"$f":"VLOOKUP(B577,'2022emp'!$A$2:$F$633,4,FALSE)","v":58000},{"$f":"VLOOKUP(B577,'2022emp'!$A$2:$H$633,7,FALSE)","v":10000},{"$f":"VLOOKUP(B577,'2022emp'!$A$2:$H$633,8,FALSE)","v":900},0,18.96551724137931,"Very Manufacturing Dependent",19]
["South West","The Cotswolds",5000,48000,10.416666666666668,340,345,350,-10,-5,"Geoffrey","Clifton-Brown","Conservative","Hold","Geoffrey","Clifton-Brown","Conservative",5000,450,"Same MP","Geoffrey Clifton-Brown",null,"Manufacturing Dependent",10.416666666666668,10.4,10.4,345,{"$f":"VLOOKUP(B578,'2022emp'!$A$2:$B$633,2,FALSE)","v":6000},{"$f":"VLOOKUP(B578,'2022emp'!$A$2:$F$633,4,FALSE)","v":51000},{"$f":"VLOOKUP(B578,'2022emp'!$A$2:$H$633,7,FALSE)","v":5000},{"$f":"VLOOKUP(B578,'2022emp'!$A$2:$H$633,8,FALSE)","v":500},0,11.76470588235294,"Manufacturing Dependent",11.8]
["West Midlands","The Wrekin",4500,38000,11.842105263157894,160,150,150,10,10,"Mark","Pritchard","Conservative","Hold","Mark","Pritchard","Conservative",4500,225,"Same MP","Mark Pritchard",null,"Manufacturing Dependent",12.5,12.5,12.5,165,{"$f":"VLOOKUP(B579,'2022emp'!$A$2:$B$633,2,FALSE)","v":4500},{"$f":"VLOOKUP(B579,'2022emp'!$A$2:$F$633,4,FALSE)","v":40000},{"$f":"VLOOKUP(B579,'2022emp'!$A$2:$H$633,7,FALSE)","v":4500},{"$f":"VLOOKUP(B579,'2022emp'!$A$2:$H$633,8,FALSE)","v":250},15,11.25,"Manufacturing Dependent",11.3]
["Yorkshire & the Humber","Thirsk and Malton",8000,39000,20.512820512820511,390,370,380,10,20,"Kevin","Hollinrake","Conservative","Hold","Kevin","Hollinrake","Conservative",8000,600,"Same MP","Kevin Hollinrake",null,"Very Manufacturing Dependent",20.512820512820511,20.5,20.5,395,{"$f":"VLOOKUP(B580,'2022emp'!$A$2:$B$633,2,FALSE)","v":8000},{"$f":"VLOOKUP(B580,'2022emp'!$A$2:$F$633,4,FALSE)","v":41000},{"$f":"VLOOKUP(B580,'2022emp'!$A$2:$H$633,7,FALSE)","v":8000},{"$f":"VLOOKUP(B580,'2022emp'!$A$2:$H$633,8,FALSE)","v":600},25,19.512195121951219,"Very Manufacturing Dependent",19.5]
["South West","Thornbury and Yate",3000,38000,7.8947368421052628,250,250,245,5,0,"Luke","Hall","Conservative","Hold","Luke","Hall","Conservative",3000,300,"Same MP","Luke Hall",null,"Not Manufacturing Dependent",7.8947368421052628,7.9,7.9,240,{"$f":"VLOOKUP(B581,'2022emp'!$A$2:$B$633,2,FALSE)","v":3500},{"$f":"VLOOKUP(B581,'2022emp'!$A$2:$F$633,4,FALSE)","v":39000},{"$f":"VLOOKUP(B581,'2022emp'!$A$2:$H$633,7,FALSE)","v":3000},{"$f":"VLOOKUP(B581,'2022emp'!$A$2:$H$633,8,FALSE)","v":300},-10,8.9743589743589745,"Manufacturing Dependent",9]
["Eastern","Thurrock",2250,63000,3.5714285714285712,185,190,195,-10,-5,"Jackie","Doyle-Price","Conservative","Hold","Jackie","Doyle-Price","Conservative",2000,200,"Same MP","Jackie Doyle-Price",null,"Not Manufacturing Dependent",4.3859649122807012,4.4000000000000004,4.4000000000000004,195,{"$f":"VLOOKUP(B582,'2022emp'!$A$2:$B$633,2,FALSE)","v":2500},{"$f":"VLOOKUP(B582,'2022emp'!$A$2:$F$633,4,FALSE)","v":62000},{"$f":"VLOOKUP(B582,'2022emp'!$A$2:$H$633,7,FALSE)","v":2500},{"$f":"VLOOKUP(B582,'2022emp'!$A$2:$H$633,8,FALSE)","v":150},5,4.032258064516129,"Not Manufacturing Dependent",4]
["South West","Tiverton and Honiton",4500,32000,14.0625,325,325,335,-10,0,"Richard","Foord","Liberal Democrat","Change","Neil","Parish","Conservative",4000,300,"New MP","Richard Foord",null,"Manufacturing Dependent",13.636363636363635,13.6,13.6,330,{"$f":"VLOOKUP(B583,'2022emp'!$A$2:$B$633,2,FALSE)","v":5000},{"$f":"VLOOKUP(B583,'2022emp'!$A$2:$F$633,4,FALSE)","v":35000},{"$f":"VLOOKUP(B583,'2022emp'!$A$2:$H$633,7,FALSE)","v":4000},{"$f":"VLOOKUP(B583,'2022emp'!$A$2:$H$633,8,FALSE)","v":900},5,14.285714285714285,"Manufacturing Dependent",14.3]
["South East","Tonbridge and Malling",2500,44000,5.6818181818181817,250,255,255,-5,-5,"Thomas","Tugendhat","Conservative","Hold","Thomas","Tugendhat","Conservative",2000,400,"Same MP","Thomas Tugendhat",null,"Not Manufacturing Dependent",5.8139534883720927,5.8,5.8,245,{"$f":"VLOOKUP(B584,'2022emp'!$A$2:$B$633,2,FALSE)","v":2250},{"$f":"VLOOKUP(B584,'2022emp'!$A$2:$F$633,4,FALSE)","v":45000},{"$f":"VLOOKUP(B584,'2022emp'!$A$2:$H$633,7,FALSE)","v":1750},{"$f":"VLOOKUP(B584,'2022emp'!$A$2:$H$633,8,FALSE)","v":300},-10,5,"Not Manufacturing Dependent",5]
["London","Tooting",450,42000,1.0714285714285714,125,130,130,{"$f":"F585-H585","v":-5},{"$f":"F585-G585","v":-5},"Rosena","Allin-Khan","Labour","Hold","Rosena","Allin-Khan","Labour",350,100,"Same MP",{"$f":"CONCATENATE(K585,\" \",L585)","v":"Rosena Allin-Khan"},null,{"$f":"IF(E585>24.29, \"Extremely Manufacturing Dependent\", IF(E585>16.59, \"Very Manufacturing Dependent\", IF(E585>8.09, \"Manufacturing Dependent\", \"Not Manufacturing Dependent\")))","v":"Not Manufacturing Dependent"},1.097560975609756,1.1000000000000001,1.1000000000000001,125,{"$f":"VLOOKUP(B585,'2022emp'!$A$2:$B$633,2,FALSE)","v":500},{"$f":"VLOOKUP(B585,'2022emp'!$A$2:$F$633,4,FALSE)","v":46000},{"$f":"VLOOKUP(B585,'2022emp'!$A$2:$H$633,7,FALSE)","v":400},{"$f":"VLOOKUP(B585,'2022emp'!$A$2:$H$633,8,FALSE)","v":100},-5,1.0869565217391304,"Not Manufacturing Dependent",1.1000000000000001]
["South West","Torbay",600,36000,1.6666666666666667,115,115,120,-5,0,"Kevin","Foster","Conservative",{"$f":"IF(M586=Q586, \"Hold\", \"Change\")","v":"Hold"},"Kevin","Foster","Conservative",600,50,{"$f":"IF(L586=P586, \"Same MP\", \"New MP\")","v":"Same MP"},"Kevin Foster",null,"Not Manufacturing Dependent",1.6666666666666667,{"$f":"ROUND(X586,1)","v":1.7},1.7,130,{"$f":"VLOOKUP(B586,'2022emp'!$A$2:$B$633,2,FALSE)","v":700},{"$f":"VLOOKUP(B586,'2022emp'!$A$2:$F$633,4,FALSE)","v":38000},{"$f":"VLOOKUP(B586,'2022emp'!$A$2:$H$633,7,FALSE)","v":600},{"$f":"VLOOKUP(B586,'2022emp'!$A$2:$H$633,8,FALSE)","v":75},{"$f":"AA586-G586","v":15},{"$f":"(AB586/AC586)*100","v":1.8421052631578945},{"$f":"IF(AG586>26.79, \"Extremely Manufacturing Dependent\", IF(AG586>17.86, \"Very Manufacturing Dependent\", IF(AG586>8.93, \"Manufacturing Dependent\", \"Not Manufacturing Dependent\")))","v":"Not Manufacturing Dependent"},{"$f":"ROUND(AG586,1)","v":1.8}]
["Wales","Torfaen",6000,33000,{"$f":"(C587/D587)*100","v":18.181818181818183},200,195,195,5,5,"Nick","Thomas-Symonds","Labour","Hold","Nick","Thomas-Symonds","Labour",6000,600,"Same MP","Nick Thomas-Symonds",null,"Very Manufacturing Dependent",19.35483870967742,19.399999999999999,19.399999999999999,185,{"$f":"VLOOKUP(B587,'2022emp'!$A$2:$B$633,2,FALSE)","v":6000},{"$f":"VLOOKUP(B587,'2022emp'!$A$2:$F$633,4,FALSE)","v":31000},{"$f":"VLOOKUP(B587,'2022emp'!$A$2:$H$633,7,FALSE)","v":5000},{"$f":"VLOOKUP(B587,'2022emp'!$A$2:$H$633,8,FALSE)","v":400},-10,19.35483870967742,"Very Manufacturing Dependent",19.399999999999999]
["South West","Torridge and West Devon",2250,27000,8.3333333333333321,225,230,215,10,-5,"Geoffrey","Cox","Conservative","Hold","Geoffrey","Cox","Conservative",2000,225,"Same MP","Geoffrey Cox",null,"Manufacturing Dependent",8.9285714285714288,8.9,8.9,230,{"$f":"VLOOKUP(B588,'2022emp'!$A$2:$B$633,2,FALSE)","v":2500},{"$f":"VLOOKUP(B588,'2022emp'!$A$2:$F$633,4,FALSE)","v":28000},{"$f":"VLOOKUP(B588,'2022emp'!$A$2:$H$633,7,FALSE)","v":2250},{"$f":"VLOOKUP(B588,'2022emp'!$A$2:$H$633,8,FALSE)","v":300},0,8.9285714285714288,"Not Manufacturing Dependent",8.9]
["South West","Totnes",2500,30000,8.3333333333333321,260,255,270,-10,5,"Anthony","Mangnall","Conservative","Hold","Anthony","Mangnall","Conservative",2500,300,"Same MP","Anthony Mangnall",null,"Manufacturing Dependent",7.5,7.5,7.5,255,{"$f":"VLOOKUP(B589,'2022emp'!$A$2:$B$633,2,FALSE)","v":2500},{"$f":"VLOOKUP(B589,'2022emp'!$A$2:$F$633,4,FALSE)","v":32000},{"$f":"VLOOKUP(B589,'2022emp'!$A$2:$H$633,7,FALSE)","v":2250},{"$f":"VLOOKUP(B589,'2022emp'!$A$2:$H$633,8,FALSE)","v":450},0,7.8125,"Not Manufacturing Dependent",7.8]
["London","Tottenham",2250,35000,6.4285714285714279,300,275,295,5,25,"David","Lammy","Labour","Hold","David","Lammy","Labour",1750,600,"Same MP","David Lammy",null,"Not Manufacturing Dependent",7.8125,7.8,7.8,330,{"$f":"VLOOKUP(B590,'2022emp'!$A$2:$B$633,2,FALSE)","v":2250},{"$f":"VLOOKUP(B590,'2022emp'!$A$2:$F$633,4,FALSE)","v":37000},{"$f":"VLOOKUP(B590,'2022emp'!$A$2:$H$633,7,FALSE)","v":2000},{"$f":"VLOOKUP(B590,'2022emp'!$A$2:$H$633,8,FALSE)","v":400},55,6.0810810810810816,"Not Manufacturing Dependent",6.1]
["South West","Truro and Falmouth",3000,58000,5.1724137931034484,220,220,220,0,0,"Cherilyn","Mackrory","Conservative","Hold","Cherilyn","Mackrory","Conservative",3000,300,"Same MP","Cherilyn Mackrory",null,"Not Manufacturing Dependent",4.4642857142857144,4.5,4.5,235,{"$f":"VLOOKUP(B591,'2022emp'!$A$2:$B$633,2,FALSE)","v":3500},{"$f":"VLOOKUP(B591,'2022emp'!$A$2:$F$633,4,FALSE)","v":56000},{"$f":"VLOOKUP(B591,'2022emp'!$A$2:$H$633,7,FALSE)","v":3500},{"$f":"VLOOKUP(B591,'2022emp'!$A$2:$H$633,8,FALSE)","v":350},15,6.25,"Not Manufacturing Dependent",6.3]
["South East","Tunbridge Wells",1750,45000,3.8888888888888888,220,210,225,-5,10,"Greg","Clark","Conservative","Hold","Greg","Clark","Conservative",1500,250,"Same MP","Greg Clark",null,"Not Manufacturing Dependent",4.3478260869565215,4.3,4.3,220,{"$f":"VLOOKUP(B592,'2022emp'!$A$2:$B$633,2,FALSE)","v":2000},{"$f":"VLOOKUP(B592,'2022emp'!$A$2:$F$633,4,FALSE)","v":48000},{"$f":"VLOOKUP(B592,'2022emp'!$A$2:$H$633,7,FALSE)","v":1500},{"$f":"VLOOKUP(B592,'2022emp'!$A$2:$H$633,8,FALSE)","v":450},10,4.1666666666666661,"Not Manufacturing Dependent",4.2]
["London","Twickenham",700,43000,1.6279069767441861,170,175,185,-15,-5,"Munira","Wilson","Liberal Democrat","Hold","Munira","Wilson","Liberal Democrat",600,75,"Same MP","Munira Wilson",null,"Not Manufacturing Dependent",1.3333333333333335,1.3,1.3,160,{"$f":"VLOOKUP(B593,'2022emp'!$A$2:$B$633,2,FALSE)","v":700},{"$f":"VLOOKUP(B593,'2022emp'!$A$2:$F$633,4,FALSE)","v":44000},{"$f":"VLOOKUP(B593,'2022emp'!$A$2:$H$633,7,FALSE)","v":600},{"$f":"VLOOKUP(B593,'2022emp'!$A$2:$H$633,8,FALSE)","v":50},-15,1.5909090909090908,"Not Manufacturing Dependent",1.6]
["North East","Tynemouth",2500,40000,6.25,190,195,195,-5,-5,"Alan","Campbell","Labour","Hold","Alan","Campbell","Labour",2500,125,"Same MP","Alan Campbell",null,"Not Manufacturing Dependent",6.8181818181818175,6.8,6.8,175,{"$f":"VLOOKUP(B594,'2022emp'!$A$2:$B$633,2,FALSE)","v":2000},{"$f":"VLOOKUP(B594,'2022emp'!$A$2:$F$633,4,FALSE)","v":43000},{"$f":"VLOOKUP(B594,'2022emp'!$A$2:$H$633,7,FALSE)","v":1750},{"$f":"VLOOKUP(B594,'2022emp'!$A$2:$H$633,8,FALSE)","v":225},-20,4.6511627906976747,"Not Manufacturing Dependent",4.7]
["Northern Ireland","Upper Bann",null,null,{"$error":"#DIV/0!"},295,260,275,20,35,"Carla","Lockhart","DUP","Hold","Carla","Lockhart","DUP",null,null,"Same MP","Carla Lockhart",null,{"$error":"#DIV/0!"},19.152573048846701,19.2,19.2,295,{"$f":"VLOOKUP(B595,'2022emp'!$A$2:$B$633,2,FALSE)","v":{"$error":"#N/A"}},{"$f":"VLOOKUP(B595,'2022emp'!$A$2:$F$633,4,FALSE)","v":{"$error":"#N/A"}},{"$f":"VLOOKUP(B595,'2022emp'!$A$2:$H$633,7,FALSE)","v":{"$error":"#N/A"}},{"$f":"VLOOKUP(B595,'2022emp'!$A$2:$H$633,8,FALSE)","v":{"$error":"#N/A"}},35,null,"Not Manufacturing Dependent",0]
["London","Uxbridge and South Ruislip",4500,76000,5.9210526315789469,190,200,190,0,-10,"Steve","Tuckwell","Conservative","Hold","Boris","Johnson","Conservative",4000,450,"New MP","Steve Tuckwell",null,"Not Manufacturing Dependent",7.3529411764705888,7.4,7.4,225,{"$f":"VLOOKUP(B596,'2022emp'!$A$2:$B$633,2,FALSE)","v":4000},{"$f":"VLOOKUP(B596,'2022emp'!$A$2:$F$633,4,FALSE)","v":73000},{"$f":"VLOOKUP(B596,'2022emp'!$A$2:$H$633,7,FALSE)","v":3500},{"$f":"VLOOKUP(B596,'2022emp'!$A$2:$H$633,8,FALSE)","v":350},25,5.4794520547945202,"Not Manufacturing Dependent",5.5]
["Wales","Vale of Clwyd",2500,32000,7.8125,135,135,135,0,0,"James","Davies","Conservative","Hold","James","Davies","Conservative",2250,150,"Same MP","James Davies",null,"Not Manufacturing Dependent",7.2580645161290329,7.3,7.3,140,{"$f":"VLOOKUP(B597,'2022emp'!$A$2:$B$633,2,FALSE)","v":2250},{"$f":"VLOOKUP(B597,'2022emp'!$A$2:$F$633,4,FALSE)","v":33000},{"$f":"VLOOKUP(B597,'2022emp'!$A$2:$H$633,7,FALSE)","v":2000},{"$f":"VLOOKUP(B597,'2022emp'!$A$2:$H$633,8,FALSE)","v":150},5,6.8181818181818175,"Not Manufacturing Dependent",6.8]
["Wales","Vale of Glamorgan",3500,28000,12.5,195,185,190,5,10,"Alun","Cairns","Conservative","Hold","Alun","Cairns","Conservative",3500,150,"Same MP","Alun Cairns",null,"Manufacturing Dependent",10.344827586206897,10.3,10.3,180,{"$f":"VLOOKUP(B598,'2022emp'!$A$2:$B$633,2,FALSE)","v":3500},{"$f":"VLOOKUP(B598,'2022emp'!$A$2:$F$633,4,FALSE)","v":31000},{"$f":"VLOOKUP(B598,'2022emp'!$A$2:$H$633,7,FALSE)","v":3000},{"$f":"VLOOKUP(B598,'2022emp'!$A$2:$H$633,8,FALSE)","v":150},-5,11.29032258064516,"Manufacturing Dependent",11.3]
["London","Vauxhall",600,96000,0.625,160,125,135,25,35,"Florence","Eshalomi","Labour/Co-operative","Hold","Florence","Eshalomi","Labour/Co-operative",450,125,"Same MP","Florence Eshalomi",null,"Not Manufacturing Dependent",0.57692307692307698,0.6,0.6,150,{"$f":"VLOOKUP(B599,'2022emp'!$A$2:$B$633,2,FALSE)","v":700},{"$f":"VLOOKUP(B599,'2022emp'!$A$2:$F$633,4,FALSE)","v":99000},{"$f":"VLOOKUP(B599,'2022emp'!$A$2:$H$633,7,FALSE)","v":700},{"$f":"VLOOKUP(B599,'2022emp'!$A$2:$H$633,8,FALSE)","v":75},25,0.70707070707070707,"Not Manufacturing Dependent",0.7]
["Yorkshire & the Humber","Wakefield",4500,56000,8.0357142857142865,300,290,295,5,10,"Simon","Lightwood","Labour","Change","Imran Nasir Ahmad","Khan","Conservative",4500,450,"New MP","Simon Lightwood",null,"Not Manufacturing Dependent",10.526315789473683,10.5,10.5,295,{"$f":"VLOOKUP(B600,'2022emp'!$A$2:$B$633,2,FALSE)","v":5000},{"$f":"VLOOKUP(B600,'2022emp'!$A$2:$F$633,4,FALSE)","v":59000},{"$f":"VLOOKUP(B600,'2022emp'!$A$2:$H$633,7,FALSE)","v":4500},{"$f":"VLOOKUP(B600,'2022emp'!$A$2:$H$633,8,FALSE)","v":500},5,8.4745762711864394,"Not Manufacturing Dependent",8.5]
["North West","Wallasey",2000,19000,10.526315789473683,130,135,135,-5,-5,"Angela","Eagle","Labour","Hold","Angela","Eagle","Labour",1750,350,"Same MP","Angela Eagle",null,"Manufacturing Dependent",10.526315789473683,10.5,10.5,125,{"$f":"VLOOKUP(B601,'2022emp'!$A$2:$B$633,2,FALSE)","v":1750},{"$f":"VLOOKUP(B601,'2022emp'!$A$2:$F$633,4,FALSE)","v":19000},{"$f":"VLOOKUP(B601,'2022emp'!$A$2:$H$633,7,FALSE)","v":1500},{"$f":"VLOOKUP(B601,'2022emp'!$A$2:$H$633,8,FALSE)","v":250},-10,9.2105263157894726,"Manufacturing Dependent",9.1999999999999993]
["West Midlands","Walsall North",4000,32000,12.5,290,300,290,0,-10,"Eddie","Hughes","Conservative","Hold","Eddie","Hughes","Conservative",3500,500,"Same MP","Eddie Hughes",null,"Manufacturing Dependent",13.23529411764706,13.2,13.2,265,{"$f":"VLOOKUP(B602,'2022emp'!$A$2:$B$633,2,FALSE)","v":4500},{"$f":"VLOOKUP(B602,'2022emp'!$A$2:$F$633,4,FALSE)","v":30000},{"$f":"VLOOKUP(B602,'2022emp'!$A$2:$H$633,7,FALSE)","v":4000},{"$f":"VLOOKUP(B602,'2022emp'!$A$2:$H$633,8,FALSE)","v":700},-35,15,"Manufacturing Dependent",15]
["West Midlands","Walsall South",4500,44000,10.227272727272728,240,250,250,-10,-10,"Valerie","Vaz","Labour","Hold","Valerie","Vaz","Labour",4000,450,"Same MP","Valerie Vaz",null,"Manufacturing Dependent",9,9,9,255,{"$f":"VLOOKUP(B603,'2022emp'!$A$2:$B$633,2,FALSE)","v":5000},{"$f":"VLOOKUP(B603,'2022emp'!$A$2:$F$633,4,FALSE)","v":47000},{"$f":"VLOOKUP(B603,'2022emp'!$A$2:$H$633,7,FALSE)","v":4000},{"$f":"VLOOKUP(B603,'2022emp'!$A$2:$H$633,8,FALSE)","v":800},5,10.638297872340425,"Manufacturing Dependent",10.6]
["London","Walthamstow",1500,28000,5.3571428571428568,225,200,195,30,25,"Stella","Creasy","Labour/Co-operative","Hold","Stella","Creasy","Labour/Co-operative",1250,300,"Same MP","Stella Creasy",null,"Not Manufacturing Dependent",6.25,6.3,6.3,240,{"$f":"VLOOKUP(B604,'2022emp'!$A$2:$B$633,2,FALSE)","v":1500},{"$f":"VLOOKUP(B604,'2022emp'!$A$2:$F$633,4,FALSE)","v":30000},{"$f":"VLOOKUP(B604,'2022emp'!$A$2:$H$633,7,FALSE)","v":1250},{"$f":"VLOOKUP(B604,'2022emp'!$A$2:$H$633,8,FALSE)","v":225},40,5,"Not Manufacturing Dependent",5]
["North East","Wansbeck",1750,24000,7.291666666666667,135,115,120,15,20,"Ian","Lavery","Labour","Hold","Ian","Lavery","Labour",1750,100,"Same MP","Ian Lavery",null,"Not Manufacturing Dependent",9,9,9,115,{"$f":"VLOOKUP(B605,'2022emp'!$A$2:$B$633,2,FALSE)","v":2000},{"$f":"VLOOKUP(B605,'2022emp'!$A$2:$F$633,4,FALSE)","v":25000},{"$f":"VLOOKUP(B605,'2022emp'!$A$2:$H$633,7,FALSE)","v":1750},{"$f":"VLOOKUP(B605,'2022emp'!$A$2:$H$633,8,FALSE)","v":175},0,8,"Not Manufacturing Dependent",8]
["South East","Wantage",3000,54000,5.5555555555555554,255,280,270,-15,-25,"David","Johnston","Conservative","Hold","David","Johnston","Conservative",2500,350,"Same MP","David Johnston",null,"Not Manufacturing Dependent",6.3636363636363633,6.4,6.4,250,{"$f":"VLOOKUP(B606,'2022emp'!$A$2:$B$633,2,FALSE)","v":4500},{"$f":"VLOOKUP(B606,'2022emp'!$A$2:$F$633,4,FALSE)","v":62000},{"$f":"VLOOKUP(B606,'2022emp'!$A$2:$H$633,7,FALSE)","v":4000},{"$f":"VLOOKUP(B606,'2022emp'!$A$2:$H$633,8,FALSE)","v":400},-30,7.2580645161290329,"Not Manufacturing Dependent",7.3]
["West Midlands","Warley",3500,26000,13.461538461538462,205,185,195,10,20,"John","Spellar","Labour","Hold","John","Spellar","Labour",3000,300,"Same MP","John Spellar",null,"Manufacturing Dependent",14.285714285714285,14.3,14.3,215,{"$f":"VLOOKUP(B607,'2022emp'!$A$2:$B$633,2,FALSE)","v":4000},{"$f":"VLOOKUP(B607,'2022emp'!$A$2:$F$633,4,FALSE)","v":28000},{"$f":"VLOOKUP(B607,'2022emp'!$A$2:$H$633,7,FALSE)","v":3500},{"$f":"VLOOKUP(B607,'2022emp'!$A$2:$H$633,8,FALSE)","v":500},30,14.285714285714285,"Manufacturing Dependent",14.3]
["North West","Warrington North",4500,63000,7.1428571428571423,210,220,225,-15,-10,"Charlotte","Nichols","Labour","Hold","Charlotte","Nichols","Labour",4000,500,"Same MP","Charlotte Nichols",null,"Not Manufacturing Dependent",7.3770491803278686,7.4,7.4,205,{"$f":"VLOOKUP(B608,'2022emp'!$A$2:$B$633,2,FALSE)","v":4500},{"$f":"VLOOKUP(B608,'2022emp'!$A$2:$F$633,4,FALSE)","v":66000},{"$f":"VLOOKUP(B608,'2022emp'!$A$2:$H$633,7,FALSE)","v":4000},{"$f":"VLOOKUP(B608,'2022emp'!$A$2:$H$633,8,FALSE)","v":350},-15,6.8181818181818175,"Not Manufacturing Dependent",6.8]
["North West","Warrington South",2250,77000,2.9220779220779218,235,240,250,-15,-5,"Andy","Carter","Conservative","Hold","Andy","Carter","Conservative",2000,300,"Same MP","Andy Carter",null,"Not Manufacturing Dependent",4.0540540540540544,4.0999999999999996,4.0999999999999996,200,{"$f":"VLOOKUP(B609,'2022emp'!$A$2:$B$633,2,FALSE)","v":2000},{"$f":"VLOOKUP(B609,'2022emp'!$A$2:$F$633,4,FALSE)","v":72000},{"$f":"VLOOKUP(B609,'2022emp'!$A$2:$H$633,7,FALSE)","v":1750},{"$f":"VLOOKUP(B609,'2022emp'!$A$2:$H$633,8,FALSE)","v":175},-40,2.7777777777777777,"Not Manufacturing Dependent",2.8]
["West Midlands","Warwick and Leamington",4000,67000,5.9701492537313428,235,265,290,-55,-30,"Matt","Western","Labour","Hold","Matt","Western","Labour",3500,225,"Same MP","Matt Western",null,"Not Manufacturing Dependent",6.8181818181818175,6.8,6.8,220,{"$f":"VLOOKUP(B610,'2022emp'!$A$2:$B$633,2,FALSE)","v":4000},{"$f":"VLOOKUP(B610,'2022emp'!$A$2:$F$633,4,FALSE)","v":71000},{"$f":"VLOOKUP(B610,'2022emp'!$A$2:$H$633,7,FALSE)","v":3500},{"$f":"VLOOKUP(B610,'2022emp'!$A$2:$H$633,8,FALSE)","v":400},-45,5.6338028169014089,"Not Manufacturing Dependent",5.6]
["North East","Washington and Sunderland West",16000,45000,35.555555555555557,200,195,195,5,5,"Sharon","Hodgson","Labour","Hold","Sharon","Hodgson","Labour",15000,350,"Same MP","Sharon Hodgson",null,"Extremely Manufacturing Dependent",35.555555555555557,35.6,35.6,200,{"$f":"VLOOKUP(B611,'2022emp'!$A$2:$B$633,2,FALSE)","v":15000},{"$f":"VLOOKUP(B611,'2022emp'!$A$2:$F$633,4,FALSE)","v":43000},{"$f":"VLOOKUP(B611,'2022emp'!$A$2:$H$633,7,FALSE)","v":15000},{"$f":"VLOOKUP(B611,'2022emp'!$A$2:$H$633,8,FALSE)","v":500},5,34.883720930232556,"Extremely Manufacturing Dependent",34.9]
["Eastern","Watford",1750,75000,2.3333333333333335,220,225,220,0,-5,"Dean","Russell","Conservative","Hold","Dean","Russell","Conservative",1500,225,"Same MP","Dean Russell",null,"Not Manufacturing Dependent",2.0270270270270272,2,2,205,{"$f":"VLOOKUP(B612,'2022emp'!$A$2:$B$633,2,FALSE)","v":2000},{"$f":"VLOOKUP(B612,'2022emp'!$A$2:$F$633,4,FALSE)","v":76000},{"$f":"VLOOKUP(B612,'2022emp'!$A$2:$H$633,7,FALSE)","v":1750},{"$f":"VLOOKUP(B612,'2022emp'!$A$2:$H$633,8,FALSE)","v":350},-20,2.6315789473684208,"Not Manufacturing Dependent",2.6]
["Eastern","Waveney",5000,34000,14.705882352941178,205,205,210,-5,0,"Peter","Aldous","Conservative","Hold","Peter","Aldous","Conservative",4500,500,"Same MP","Peter Aldous",null,"Manufacturing Dependent",14.705882352941178,14.7,14.7,185,{"$f":"VLOOKUP(B613,'2022emp'!$A$2:$B$633,2,FALSE)","v":4500},{"$f":"VLOOKUP(B613,'2022emp'!$A$2:$F$633,4,FALSE)","v":34000},{"$f":"VLOOKUP(B613,'2022emp'!$A$2:$H$633,7,FALSE)","v":4000},{"$f":"VLOOKUP(B613,'2022emp'!$A$2:$H$633,8,FALSE)","v":400},-20,13.23529411764706,"Manufacturing Dependent",13.2]
["South East","Wealden",3000,34000,8.8235294117647065,335,345,330,5,-10,"Nusrat","Ghani","Conservative","Hold","Nusrat","Ghani","Conservative",2500,350,"Same MP","Nusrat Ghani",null,"Manufacturing Dependent",8.3333333333333321,8.3000000000000007,8.3000000000000007,330,{"$f":"VLOOKUP(B614,'2022emp'!$A$2:$B$633,2,FALSE)","v":3000},{"$f":"VLOOKUP(B614,'2022emp'!$A$2:$F$633,4,FALSE)","v":35000},{"$f":"VLOOKUP(B614,'2022emp'!$A$2:$H$633,7,FALSE)","v":2500},{"$f":"VLOOKUP(B614,'2022emp'!$A$2:$H$633,8,FALSE)","v":350},-15,8.5714285714285712,"Not Manufacturing Dependent",8.6]
["North West","Weaver Vale",5000,46000,10.869565217391305,190,170,180,10,20,"Mike","Amesbury","Labour","Hold","Mike","Amesbury","Labour",4500,450,"Same MP","Mike Amesbury",null,"Manufacturing Dependent",10.204081632653061,10.199999999999999,10.199999999999999,175,{"$f":"VLOOKUP(B615,'2022emp'!$A$2:$B$633,2,FALSE)","v":5000},{"$f":"VLOOKUP(B615,'2022emp'!$A$2:$F$633,4,FALSE)","v":44000},{"$f":"VLOOKUP(B615,'2022emp'!$A$2:$H$633,7,FALSE)","v":4500},{"$f":"VLOOKUP(B615,'2022emp'!$A$2:$H$633,8,FALSE)","v":400},5,11.363636363636363,"Manufacturing Dependent",11.4]
["East Midlands","Wellingborough",6000,45000,13.333333333333334,325,335,330,-5,-10,"Gen","Kitchen","Labour","Change","Peter","Bone","Conservative",6000,600,"New MP","Gen Kitchen",null,"Manufacturing Dependent",15.555555555555555,15.6,15.6,295,{"$f":"VLOOKUP(B616,'2022emp'!$A$2:$B$633,2,FALSE)","v":6000},{"$f":"VLOOKUP(B616,'2022emp'!$A$2:$F$633,4,FALSE)","v":46000},{"$f":"VLOOKUP(B616,'2022emp'!$A$2:$H$633,7,FALSE)","v":6000},{"$f":"VLOOKUP(B616,'2022emp'!$A$2:$H$633,8,FALSE)","v":500},-40,13.043478260869565,"Manufacturing Dependent",13]
["South West","Wells",4000,42000,9.5238095238095237,305,310,295,10,-5,"James","Heappey","Conservative","Hold","James","Heappey","Conservative",3500,350,"Same MP","James Heappey",null,"Manufacturing Dependent",10,10,10,300,{"$f":"VLOOKUP(B617,'2022emp'!$A$2:$B$633,2,FALSE)","v":5000},{"$f":"VLOOKUP(B617,'2022emp'!$A$2:$F$633,4,FALSE)","v":43000},{"$f":"VLOOKUP(B617,'2022emp'!$A$2:$H$633,7,FALSE)","v":4500},{"$f":"VLOOKUP(B617,'2022emp'!$A$2:$H$633,8,FALSE)","v":600},-10,11.627906976744185,"Manufacturing Dependent",11.6]
["Eastern","Welwyn Hatfield",3500,87000,4.0229885057471266,210,230,225,-15,-20,"Grant","Shapps","Conservative","Hold","Grant","Shapps","Conservative",3000,400,"Same MP",{"$f":"CONCATENATE(K618,\" \",L618)","v":"Grant Shapps"},null,"Not Manufacturing Dependent",3.8461538461538463,3.8,3.8,190,{"$f":"VLOOKUP(B618,'2022emp'!$A$2:$B$633,2,FALSE)","v":4000},{"$f":"VLOOKUP(B618,'2022emp'!$A$2:$F$633,4,FALSE)","v":79000},{"$f":"VLOOKUP(B618,'2022emp'!$A$2:$H$633,7,FALSE)","v":3000},{"$f":"VLOOKUP(B618,'2022emp'!$A$2:$H$633,8,FALSE)","v":600},-40,5.0632911392405067,"Not Manufacturing Dependent",5.0999999999999996]
["Yorkshire & the Humber","Wentworth and Dearne",3500,35000,10,205,200,195,10,5,"John","Healey","Labour","Hold","John","Healey","Labour",3500,300,"Same MP",{"$f":"CONCATENATE(K619,\" \",L619)","v":"John Healey"},null,"Manufacturing Dependent",11.111111111111111,11.1,11.1,195,{"$f":"VLOOKUP(B619,'2022emp'!$A$2:$B$633,2,FALSE)","v":4000},{"$f":"VLOOKUP(B619,'2022emp'!$A$2:$F$633,4,FALSE)","v":36000},{"$f":"VLOOKUP(B619,'2022emp'!$A$2:$H$633,7,FALSE)","v":3500},{"$f":"VLOOKUP(B619,'2022emp'!$A$2:$H$633,8,FALSE)","v":300},-5,11.111111111111111,"Manufacturing Dependent",11.1]
["Scotland","West Aberdeenshire and Kincardine",3500,40000,8.75,275,240,250,25,35,"Andrew","Bowie","Conservative","Hold","Andrew","Bowie","Conservative",3500,250,"Same MP","Andrew Bowie",null,"Manufacturing Dependent",8.536585365853659,8.5,8.5,260,{"$f":"VLOOKUP(B620,'2022emp'!$A$2:$B$633,2,FALSE)","v":4000},{"$f":"VLOOKUP(B620,'2022emp'!$A$2:$F$633,4,FALSE)","v":41000},{"$f":"VLOOKUP(B620,'2022emp'!$A$2:$H$633,7,FALSE)","v":3500},{"$f":"VLOOKUP(B620,'2022emp'!$A$2:$H$633,8,FALSE)","v":400},20,9.7560975609756095,"Manufacturing Dependent",9.8000000000000007]
["West Midlands","West Bromwich East",5000,36000,13.888888888888889,215,220,210,5,-5,"Nicola","Richards","Conservative","Hold","Nicola Faye","Richards","Conservative",5000,450,"Same MP","Nicola Richards",null,"Manufacturing Dependent",13.513513513513514,13.5,13.5,215,{"$f":"VLOOKUP(B621,'2022emp'!$A$2:$B$633,2,FALSE)","v":6000},{"$f":"VLOOKUP(B621,'2022emp'!$A$2:$F$633,4,FALSE)","v":39000},{"$f":"VLOOKUP(B621,'2022emp'!$A$2:$H$633,7,FALSE)","v":5000},{"$f":"VLOOKUP(B621,'2022emp'!$A$2:$H$633,8,FALSE)","v":1000},-5,15.384615384615385,"Manufacturing Dependent",15.4]
["West Midlands","West Bromwich West",9000,48000,18.75,335,335,335,0,0,"Shaun","Bailey","Conservative","Hold","Shaun Stephen","Bailey","Conservative",8000,600,"Same MP","Shaun Bailey",null,"Very Manufacturing Dependent",17.647058823529413,17.600000000000001,17.600000000000001,345,{"$f":"VLOOKUP(B622,'2022emp'!$A$2:$B$633,2,FALSE)","v":10000},{"$f":"VLOOKUP(B622,'2022emp'!$A$2:$F$633,4,FALSE)","v":49000},{"$f":"VLOOKUP(B622,'2022emp'!$A$2:$H$633,7,FALSE)","v":9000},{"$f":"VLOOKUP(B622,'2022emp'!$A$2:$H$633,8,FALSE)","v":1000},10,20.408163265306122,"Very Manufacturing Dependent",20.399999999999999]
["South West","West Dorset",4000,48000,8.3333333333333321,310,295,305,5,15,"Chris","Loder","Conservative","Hold","Chris","Loder","Conservative",3500,350,"Same MP","Chris Loder",null,"Manufacturing Dependent",8.8235294117647065,8.8000000000000007,8.8000000000000007,315,{"$f":"VLOOKUP(B623,'2022emp'!$A$2:$B$633,2,FALSE)","v":5000},{"$f":"VLOOKUP(B623,'2022emp'!$A$2:$F$633,4,FALSE)","v":51000},{"$f":"VLOOKUP(B623,'2022emp'!$A$2:$H$633,7,FALSE)","v":4000},{"$f":"VLOOKUP(B623,'2022emp'!$A$2:$H$633,8,FALSE)","v":600},20,9.8039215686274517,"Manufacturing Dependent",9.8000000000000007]
["Scotland","West Dunbartonshire",2250,31000,7.2580645161290329,135,135,135,0,0,"Martin","Docherty","Scottish National Party","Hold","Martin","Docherty","Scottish National Party",2000,200,"Same MP","Martin Docherty",null,"Not Manufacturing Dependent",8.064516129032258,8.1,8.1,135,{"$f":"VLOOKUP(B624,'2022emp'!$A$2:$B$633,2,FALSE)","v":2250},{"$f":"VLOOKUP(B624,'2022emp'!$A$2:$F$633,4,FALSE)","v":32000},{"$f":"VLOOKUP(B624,'2022emp'!$A$2:$H$633,7,FALSE)","v":2250},{"$f":"VLOOKUP(B624,'2022emp'!$A$2:$H$633,8,FALSE)","v":200},0,7.03125,"Not Manufacturing Dependent",7]
["London","West Ham",2250,78000,2.8846153846153846,200,165,180,20,35,"Lyn","Brown","Labour","Hold","Lyn","Brown","Labour",2000,125,"Same MP","Lyn Brown",null,"Not Manufacturing Dependent",2.7027027027027026,2.7,2.7,215,{"$f":"VLOOKUP(B625,'2022emp'!$A$2:$B$633,2,FALSE)","v":1750},{"$f":"VLOOKUP(B625,'2022emp'!$A$2:$F$633,4,FALSE)","v":88000},{"$f":"VLOOKUP(B625,'2022emp'!$A$2:$H$633,7,FALSE)","v":1750},{"$f":"VLOOKUP(B625,'2022emp'!$A$2:$H$633,8,FALSE)","v":125},50,1.9886363636363635,"Not Manufacturing Dependent",2]
["North West","West Lancashire",7000,41000,17.073170731707318,280,250,260,20,30,"Ashley","Dalton","Labour","Hold","Rosie","Cooper","Labour",6000,700,"New MP","Ashley Dalton",null,"Very Manufacturing Dependent",15.909090909090908,15.9,15.9,270,{"$f":"VLOOKUP(B626,'2022emp'!$A$2:$B$633,2,FALSE)","v":6000},{"$f":"VLOOKUP(B626,'2022emp'!$A$2:$F$633,4,FALSE)","v":44000},{"$f":"VLOOKUP(B626,'2022emp'!$A$2:$H$633,7,FALSE)","v":5000},{"$f":"VLOOKUP(B626,'2022emp'!$A$2:$H$633,8,FALSE)","v":700},20,13.636363636363635,"Manufacturing Dependent",13.6]
["Eastern","West Suffolk",6000,41000,14.634146341463413,340,340,325,15,0,"Matthew","Hancock","Independent","Change","Matthew","Hancock","Conservative",5000,900,"Same MP","Matthew Hancock",null,"Manufacturing Dependent",14.285714285714285,14.3,14.3,330,{"$f":"VLOOKUP(B627,'2022emp'!$A$2:$B$633,2,FALSE)","v":6000},{"$f":"VLOOKUP(B627,'2022emp'!$A$2:$F$633,4,FALSE)","v":43000},{"$f":"VLOOKUP(B627,'2022emp'!$A$2:$H$633,7,FALSE)","v":5000},{"$f":"VLOOKUP(B627,'2022emp'!$A$2:$H$633,8,FALSE)","v":1000},-10,13.953488372093023,"Manufacturing Dependent",14]
["Northern Ireland","West Tyrone",null,null,{"$error":"#DIV/0!"},295,265,285,10,30,"Ã“rfhlaith","Begley","Sinn Fein","Hold","Ã“rfhlaith","Begley","Sinn Fein",null,null,"Same MP","Ã“rfhlaith Begley",null,{"$error":"#DIV/0!"},10.731945348080677,10.7,10.7,305,{"$f":"VLOOKUP(B628,'2022emp'!$A$2:$B$633,2,FALSE)","v":{"$error":"#N/A"}},{"$f":"VLOOKUP(B628,'2022emp'!$A$2:$F$633,4,FALSE)","v":{"$error":"#N/A"}},{"$f":"VLOOKUP(B628,'2022emp'!$A$2:$H$633,7,FALSE)","v":{"$error":"#N/A"}},{"$f":"VLOOKUP(B628,'2022emp'!$A$2:$H$633,8,FALSE)","v":{"$error":"#N/A"}},40,null,"Not Manufacturing Dependent",0]
["West Midlands","West Worcestershire",4500,35000,12.857142857142856,355,365,370,-15,-10,"Harriett","Baldwin","Conservative","Hold","Harriett","Baldwin","Conservative",4000,400,"Same MP","Harriett Baldwin",null,"Manufacturing Dependent",14.705882352941178,14.7,14.7,360,{"$f":"VLOOKUP(B629,'2022emp'!$A$2:$B$633,2,FALSE)","v":5000},{"$f":"VLOOKUP(B629,'2022emp'!$A$2:$F$633,4,FALSE)","v":36000},{"$f":"VLOOKUP(B629,'2022emp'!$A$2:$H$633,7,FALSE)","v":4500},{"$f":"VLOOKUP(B629,'2022emp'!$A$2:$H$633,8,FALSE)","v":700},-5,13.888888888888889,"Manufacturing Dependent",13.9]
["London","Westminster North",500,40000,1.25,145,110,125,20,35,"Karen","Buck","Labour","Hold","Karen","Buck","Labour",450,75,"Same MP","Karen Buck",null,"Not Manufacturing Dependent",0.85365853658536595,0.9,0.9,140,{"$f":"VLOOKUP(B630,'2022emp'!$A$2:$B$633,2,FALSE)","v":400},{"$f":"VLOOKUP(B630,'2022emp'!$A$2:$F$633,4,FALSE)","v":42000},{"$f":"VLOOKUP(B630,'2022emp'!$A$2:$H$633,7,FALSE)","v":350},{"$f":"VLOOKUP(B630,'2022emp'!$A$2:$H$633,8,FALSE)","v":75},30,0.95238095238095244,"Not Manufacturing Dependent",1]
["North West","Westmorland and Lonsdale",4000,42000,9.5238095238095237,285,275,280,5,10,"Tim","Farron","Liberal Democrat","Hold","Tim","Farron","Liberal Democrat",3500,700,"Same MP","Tim Farron",null,"Manufacturing Dependent",7.9545454545454541,8,8,285,{"$f":"VLOOKUP(B631,'2022emp'!$A$2:$B$633,2,FALSE)","v":3500},{"$f":"VLOOKUP(B631,'2022emp'!$A$2:$F$633,4,FALSE)","v":42000},{"$f":"VLOOKUP(B631,'2022emp'!$A$2:$H$633,7,FALSE)","v":3000},{"$f":"VLOOKUP(B631,'2022emp'!$A$2:$H$633,8,FALSE)","v":500},10,8.3333333333333321,"Not Manufacturing Dependent",8.3000000000000007]
["South West","Weston-Super-Mare",2500,42000,5.9523809523809517,175,190,195,-20,-15,"John","Penrose","Conservative","Hold","John","Penrose","Conservative",2250,150,"Same MP","John Penrose",null,"Not Manufacturing Dependent",5.8139534883720927,5.8,5.8,185,{"$f":"VLOOKUP(B632,'2022emp'!$A$2:$B$633,2,FALSE)","v":2500},{"$f":"VLOOKUP(B632,'2022emp'!$A$2:$F$633,4,FALSE)","v":42000},{"$f":"VLOOKUP(B632,'2022emp'!$A$2:$H$633,7,FALSE)","v":2500},{"$f":"VLOOKUP(B632,'2022emp'!$A$2:$H$633,8,FALSE)","v":225},-5,5.9523809523809517,"Not Manufacturing Dependent",6]
["North West","Wigan",6000,45000,13.333333333333334,215,220,220,-5,-5,"Lisa","Nandy","Labour","Hold","Lisa","Nandy","Labour",5000,450,"Same MP","Lisa Nandy",null,"Manufacturing Dependent",12.76595744680851,12.8,12.8,195,{"$f":"VLOOKUP(B633,'2022emp'!$A$2:$B$633,2,FALSE)","v":6000},{"$f":"VLOOKUP(B633,'2022emp'!$A$2:$F$633,4,FALSE)","v":48000},{"$f":"VLOOKUP(B633,'2022emp'!$A$2:$H$633,7,FALSE)","v":5000},{"$f":"VLOOKUP(B633,'2022emp'!$A$2:$H$633,8,FALSE)","v":450},-25,12.5,"Manufacturing Dependent",12.5]
["London","Wimbledon",1000,60000,1.6666666666666667,175,165,170,5,10,"Stephen","Hammond","Conservative","Hold","Stephen","Hammond","Conservative",1000,150,"Same MP","Stephen Hammond",null,"Not Manufacturing Dependent",1.639344262295082,1.6,1.6,175,{"$f":"VLOOKUP(B634,'2022emp'!$A$2:$B$633,2,FALSE)","v":1000},{"$f":"VLOOKUP(B634,'2022emp'!$A$2:$F$633,4,FALSE)","v":54000},{"$f":"VLOOKUP(B634,'2022emp'!$A$2:$H$633,7,FALSE)","v":1000},{"$f":"VLOOKUP(B634,'2022emp'!$A$2:$H$633,8,FALSE)","v":175},10,1.8518518518518516,"Not Manufacturing Dependent",1.9]
["South East","Winchester",3000,62000,4.838709677419355,215,200,210,5,15,"Steve","Brine","Conservative","Hold","Steve","Brine","Conservative",2500,300,"Same MP","Steve Brine",null,"Not Manufacturing Dependent",4.032258064516129,4,4,205,{"$f":"VLOOKUP(B635,'2022emp'!$A$2:$B$633,2,FALSE)","v":3000},{"$f":"VLOOKUP(B635,'2022emp'!$A$2:$F$633,4,FALSE)","v":62000},{"$f":"VLOOKUP(B635,'2022emp'!$A$2:$H$633,7,FALSE)","v":2500},{"$f":"VLOOKUP(B635,'2022emp'!$A$2:$H$633,8,FALSE)","v":400},5,4.838709677419355,"Not Manufacturing Dependent",4.8]
["South East","Windsor",2250,63000,3.5714285714285712,220,210,215,5,10,"Adam","Afriyie","Conservative","Hold","Adam","Afriyie","Conservative",2000,300,"Same MP","Adam Afriyie",null,"Not Manufacturing Dependent",2.3809523809523809,2.4,2.4,230,{"$f":"VLOOKUP(B636,'2022emp'!$A$2:$B$633,2,FALSE)","v":2250},{"$f":"VLOOKUP(B636,'2022emp'!$A$2:$F$633,4,FALSE)","v":75000},{"$f":"VLOOKUP(B636,'2022emp'!$A$2:$H$633,7,FALSE)","v":2000},{"$f":"VLOOKUP(B636,'2022emp'!$A$2:$H$633,8,FALSE)","v":250},20,3,"Not Manufacturing Dependent",3]
["North West","Wirral South",2500,27000,9.2592592592592595,120,115,110,10,5,"Alison","McGovern","Labour","Hold","Alison","McGovern","Labour",2500,250,"Same MP","Alison McGovern",null,"Manufacturing Dependent",10.344827586206897,10.3,10.3,105,{"$f":"VLOOKUP(B637,'2022emp'!$A$2:$B$633,2,FALSE)","v":3500},{"$f":"VLOOKUP(B637,'2022emp'!$A$2:$F$633,4,FALSE)","v":29000},{"$f":"VLOOKUP(B637,'2022emp'!$A$2:$H$633,7,FALSE)","v":3500},{"$f":"VLOOKUP(B637,'2022emp'!$A$2:$H$633,8,FALSE)","v":150},-10,12.068965517241379,"Manufacturing Dependent",12.1]
["North West","Wirral West",350,19000,1.8421052631578945,95,90,85,10,5,"Margaret","Greenwood","Labour","Hold","Margaret","Greenwood","Labour",250,75,"Same MP","Margaret Greenwood",null,"Not Manufacturing Dependent",1.5789473684210527,1.6,1.6,90,{"$f":"VLOOKUP(B638,'2022emp'!$A$2:$B$633,2,FALSE)","v":300},{"$f":"VLOOKUP(B638,'2022emp'!$A$2:$F$633,4,FALSE)","v":18000},{"$f":"VLOOKUP(B638,'2022emp'!$A$2:$H$633,7,FALSE)","v":250},{"$f":"VLOOKUP(B638,'2022emp'!$A$2:$H$633,8,FALSE)","v":40},0,1.6666666666666667,"Not Manufacturing Dependent",1.7]
["Eastern","Witham",3000,35000,8.5714285714285712,250,260,245,5,-10,"Priti","Patel","Conservative","Hold","Priti","Patel","Conservative",2500,450,"Same MP","Priti Patel",null,"Manufacturing Dependent",12.5,12.5,12.5,255,{"$f":"VLOOKUP(B639,'2022emp'!$A$2:$B$633,2,FALSE)","v":3500},{"$f":"VLOOKUP(B639,'2022emp'!$A$2:$F$633,4,FALSE)","v":36000},{"$f":"VLOOKUP(B639,'2022emp'!$A$2:$H$633,7,FALSE)","v":3000},{"$f":"VLOOKUP(B639,'2022emp'!$A$2:$H$633,8,FALSE)","v":400},-5,9.7222222222222232,"Manufacturing Dependent",9.6999999999999993]
["South East","Witney",5000,44000,11.363636363636363,275,260,255,20,15,"Robert","Courts","Conservative","Hold","Robert Alexander","Courts","Conservative",4500,800,"Same MP","Robert Courts",null,"Manufacturing Dependent",11.111111111111111,11.1,11.1,280,{"$f":"VLOOKUP(B640,'2022emp'!$A$2:$B$633,2,FALSE)","v":6000},{"$f":"VLOOKUP(B640,'2022emp'!$A$2:$F$633,4,FALSE)","v":47000},{"$f":"VLOOKUP(B640,'2022emp'!$A$2:$H$633,7,FALSE)","v":5000},{"$f":"VLOOKUP(B640,'2022emp'!$A$2:$H$633,8,FALSE)","v":500},20,12.76595744680851,"Manufacturing Dependent",12.8]
["South East","Woking",4500,48000,9.375,225,215,210,15,10,"Jonathan","Lord","Conservative","Hold","Jonathan","Lord","Conservative",4000,300,"Same MP","Jonathan Lord",null,"Manufacturing Dependent",9.183673469387756,9.1999999999999993,9.1999999999999993,190,{"$f":"VLOOKUP(B641,'2022emp'!$A$2:$B$633,2,FALSE)","v":4000},{"$f":"VLOOKUP(B641,'2022emp'!$A$2:$F$633,4,FALSE)","v":48000},{"$f":"VLOOKUP(B641,'2022emp'!$A$2:$H$633,7,FALSE)","v":4000},{"$f":"VLOOKUP(B641,'2022emp'!$A$2:$H$633,8,FALSE)","v":250},-25,8.3333333333333321,"Not Manufacturing Dependent",8.3000000000000007]
["South East","Wokingham",3500,56000,6.25,210,180,195,15,30,"John","Redwood","Conservative","Hold","John","Redwood","Conservative",3000,450,"Same MP","John Redwood",null,"Not Manufacturing Dependent",5.4545454545454541,5.5,5.5,200,{"$f":"VLOOKUP(B642,'2022emp'!$A$2:$B$633,2,FALSE)","v":3500},{"$f":"VLOOKUP(B642,'2022emp'!$A$2:$F$633,4,FALSE)","v":63000},{"$f":"VLOOKUP(B642,'2022emp'!$A$2:$H$633,7,FALSE)","v":3000},{"$f":"VLOOKUP(B642,'2022emp'!$A$2:$H$633,8,FALSE)","v":225},20,5.5555555555555554,"Not Manufacturing Dependent",5.6]
["West Midlands","Wolverhampton North East",4500,42000,10.714285714285714,185,170,165,20,15,"Jane","Stevenson","Conservative","Hold","Jane","Stevenson","Conservative",4500,300,"Same MP","Jane Stevenson",null,"Manufacturing Dependent",11.904761904761903,11.9,11.9,185,{"$f":"VLOOKUP(B643,'2022emp'!$A$2:$B$633,2,FALSE)","v":5000},{"$f":"VLOOKUP(B643,'2022emp'!$A$2:$F$633,4,FALSE)","v":45000},{"$f":"VLOOKUP(B643,'2022emp'!$A$2:$H$633,7,FALSE)","v":5000},{"$f":"VLOOKUP(B643,'2022emp'!$A$2:$H$633,8,FALSE)","v":300},15,11.111111111111111,"Manufacturing Dependent",11.1]
["West Midlands","Wolverhampton South East",6000,29000,20.689655172413794,315,325,320,-5,-10,"Pat","McFadden","Labour","Hold","Pat","McFadden","Labour",6000,500,"Same MP","Pat McFadden",null,"Very Manufacturing Dependent",23.333333333333332,23.3,23.3,335,{"$f":"VLOOKUP(B644,'2022emp'!$A$2:$B$633,2,FALSE)","v":6000},{"$f":"VLOOKUP(B644,'2022emp'!$A$2:$F$633,4,FALSE)","v":31000},{"$f":"VLOOKUP(B644,'2022emp'!$A$2:$H$633,7,FALSE)","v":6000},{"$f":"VLOOKUP(B644,'2022emp'!$A$2:$H$633,8,FALSE)","v":600},10,19.35483870967742,"Very Manufacturing Dependent",19.399999999999999]
["West Midlands","Wolverhampton South West",1500,34000,4.4117647058823533,110,145,115,-5,-35,"Stuart","Anderson","Conservative","Hold","Stuart Paul","Anderson","Conservative",1500,125,"Same MP","Stuart Anderson",null,"Not Manufacturing Dependent",5.3030303030303028,5.3,5.3,135,{"$f":"VLOOKUP(B645,'2022emp'!$A$2:$B$633,2,FALSE)","v":1750},{"$f":"VLOOKUP(B645,'2022emp'!$A$2:$F$633,4,FALSE)","v":35000},{"$f":"VLOOKUP(B645,'2022emp'!$A$2:$H$633,7,FALSE)","v":1750},{"$f":"VLOOKUP(B645,'2022emp'!$A$2:$H$633,8,FALSE)","v":175},-10,5,"Not Manufacturing Dependent",5]
["West Midlands","Worcester",3500,53000,6.6037735849056602,170,170,160,10,0,"Robin","Walker","Conservative","Hold","Robin","Walker","Conservative",3000,225,"Same MP","Robin Walker",null,"Not Manufacturing Dependent",9.2592592592592595,9.3000000000000007,9.3000000000000007,185,{"$f":"VLOOKUP(B646,'2022emp'!$A$2:$B$633,2,FALSE)","v":5000},{"$f":"VLOOKUP(B646,'2022emp'!$A$2:$F$633,4,FALSE)","v":54000},{"$f":"VLOOKUP(B646,'2022emp'!$A$2:$H$633,7,FALSE)","v":4500},{"$f":"VLOOKUP(B646,'2022emp'!$A$2:$H$633,8,FALSE)","v":600},15,9.2592592592592595,"Manufacturing Dependent",9.3000000000000007]
["North West","Workington",3500,26000,13.461538461538462,180,175,180,0,5,"Mark","Jenkinson","Conservative","Hold","Mark","Jenkinson","Conservative",3000,350,"Same MP","Mark Jenkinson",null,"Manufacturing Dependent",12.5,12.5,12.5,140,{"$f":"VLOOKUP(B647,'2022emp'!$A$2:$B$633,2,FALSE)","v":3500},{"$f":"VLOOKUP(B647,'2022emp'!$A$2:$F$633,4,FALSE)","v":26000},{"$f":"VLOOKUP(B647,'2022emp'!$A$2:$H$633,7,FALSE)","v":3000},{"$f":"VLOOKUP(B647,'2022emp'!$A$2:$H$633,8,FALSE)","v":400},-35,13.461538461538462,"Manufacturing Dependent",13.5]
["North West","Worsley and Eccles South",2250,26000,8.6538461538461533,175,165,170,5,10,"Barbara","Keeley","Labour","Hold","Barbara","Keeley","Labour",2000,250,"Same MP","Barbara Keeley",null,"Manufacturing Dependent",8.0357142857142865,8,8,155,{"$f":"VLOOKUP(B648,'2022emp'!$A$2:$B$633,2,FALSE)","v":2250},{"$f":"VLOOKUP(B648,'2022emp'!$A$2:$F$633,4,FALSE)","v":29000},{"$f":"VLOOKUP(B648,'2022emp'!$A$2:$H$633,7,FALSE)","v":2000},{"$f":"VLOOKUP(B648,'2022emp'!$A$2:$H$633,8,FALSE)","v":250},-10,7.7586206896551726,"Not Manufacturing Dependent",7.8]
["South East","Worthing West",1250,43000,2.9069767441860463,155,150,155,{"$f":"F649-H649","v":0},{"$f":"F649-G649","v":5},"Peter","Bottomley","Conservative","Hold","Peter","Bottomley","Conservative",1250,175,"Same MP","Peter Bottomley",null,{"$f":"IF(E649>24.29, \"Extremely Manufacturing Dependent\", IF(E649>16.59, \"Very Manufacturing Dependent\", IF(E649>8.09, \"Manufacturing Dependent\", \"Not Manufacturing Dependent\")))","v":"Not Manufacturing Dependent"},2.9069767441860463,2.9,2.9,150,{"$f":"VLOOKUP(B649,'2022emp'!$A$2:$B$633,2,FALSE)","v":1250},{"$f":"VLOOKUP(B649,'2022emp'!$A$2:$F$633,4,FALSE)","v":43000},{"$f":"VLOOKUP(B649,'2022emp'!$A$2:$H$633,7,FALSE)","v":1000},{"$f":"VLOOKUP(B649,'2022emp'!$A$2:$H$633,8,FALSE)","v":200},0,2.9069767441860463,"Not Manufacturing Dependent",2.9]
["Wales","Wrexham",9000,47000,19.148936170212767,195,190,200,-5,5,"Sarah","Atherton","Conservative",{"$f":"IF(M650=Q650, \"Hold\", \"Change\")","v":"Hold"},"Sarah","Atherton","Conservative",8000,600,{"$f":"IF(L650=P650, \"Same MP\", \"New MP\")","v":"Same MP"},"Sarah Atherton",null,"Very Manufacturing Dependent",20.930232558139537,{"$f":"ROUND(X650,1)","v":20.9},20.9,180,{"$f":"VLOOKUP(B650,'2022emp'!$A$2:$B$633,2,FALSE)","v":9000},{"$f":"VLOOKUP(B650,'2022emp'!$A$2:$F$633,4,FALSE)","v":45000},{"$f":"VLOOKUP(B650,'2022emp'!$A$2:$H$633,7,FALSE)","v":9000},{"$f":"VLOOKUP(B650,'2022emp'!$A$2:$H$633,8,FALSE)","v":450},{"$f":"AA650-G650","v":-10},{"$f":"(AB650/AC650)*100","v":20},{"$f":"IF(AG650>26.79, \"Extremely Manufacturing Dependent\", IF(AG650>17.86, \"Very Manufacturing Dependent\", IF(AG650>8.93, \"Manufacturing Dependent\", \"Not Manufacturing Dependent\")))","v":"Very Manufacturing Dependent"},{"$f":"ROUND(AG650,1)","v":20}]
["South East","Wycombe",4500,54000,{"$f":"(C651/D651)*100","v":8.3333333333333321},335,335,340,-5,0,"Steven","Baker","Conservative","Hold","Steven","Baker","Conservative",4000,500,"Same MP","Steven Baker",null,"Manufacturing Dependent",8.0357142857142865,8,8,305,{"$f":"VLOOKUP(B651,'2022emp'!$A$2:$B$633,2,FALSE)","v":4000},{"$f":"VLOOKUP(B651,'2022emp'!$A$2:$F$633,4,FALSE)","v":57000},{"$f":"VLOOKUP(B651,'2022emp'!$A$2:$H$633,7,FALSE)","v":3500},{"$f":"VLOOKUP(B651,'2022emp'!$A$2:$H$633,8,FALSE)","v":450},-30,7.0175438596491224,"Not Manufacturing Dependent",7]
["North West","Wyre and Preston North",2000,42000,4.7619047619047619,230,210,220,10,20,"Ben","Wallace","Conservative","Hold","Ben","Wallace","Conservative",1750,225,"Same MP","Ben Wallace",null,"Not Manufacturing Dependent",4.6052631578947363,4.5999999999999996,4.5999999999999996,225,{"$f":"VLOOKUP(B652,'2022emp'!$A$2:$B$633,2,FALSE)","v":2000},{"$f":"VLOOKUP(B652,'2022emp'!$A$2:$F$633,4,FALSE)","v":44000},{"$f":"VLOOKUP(B652,'2022emp'!$A$2:$H$633,7,FALSE)","v":1500},{"$f":"VLOOKUP(B652,'2022emp'!$A$2:$H$633,8,FALSE)","v":300},15,4.5454545454545459,"Not Manufacturing Dependent",4.5]
["West Midlands","Wyre Forest",3000,34000,8.8235294117647065,255,250,255,0,5,"Mark","Garnier","Conservative","Hold","Mark","Garnier","Conservative",3000,350,"Same MP","Mark Garnier",null,"Manufacturing Dependent",12.5,12.5,12.5,260,{"$f":"VLOOKUP(B653,'2022emp'!$A$2:$B$633,2,FALSE)","v":3500},{"$f":"VLOOKUP(B653,'2022emp'!$A$2:$F$633,4,FALSE)","v":34000},{"$f":"VLOOKUP(B653,'2022emp'!$A$2:$H$633,7,FALSE)","v":3500},{"$f":"VLOOKUP(B653,'2022emp'!$A$2:$H$633,8,FALSE)","v":350},10,10.294117647058822,"Manufacturing Dependent",10.3]
["North West","Wythenshawe and Sale East",3000,72000,4.1666666666666661,115,110,110,5,5,"Mike","Kane","Labour","Hold","Mike","Kane","Labour",2500,225,"Same MP","Mike Kane",null,"Not Manufacturing Dependent",4.7297297297297298,4.7,4.7,110,{"$f":"VLOOKUP(B654,'2022emp'!$A$2:$B$633,2,FALSE)","v":3000},{"$f":"VLOOKUP(B654,'2022emp'!$A$2:$F$633,4,FALSE)","v":74000},{"$f":"VLOOKUP(B654,'2022emp'!$A$2:$H$633,7,FALSE)","v":2500},{"$f":"VLOOKUP(B654,'2022emp'!$A$2:$H$633,8,FALSE)","v":350},0,4.0540540540540544,"Not Manufacturing Dependent",4.0999999999999996]
["South West","Yeovil",10000,47000,21.276595744680851,290,275,295,-5,15,"Marcus","Fysh","Conservative","Hold","Marcus","Fysh","Conservative",10000,700,"Same MP","Marcus Fysh",null,"Very Manufacturing Dependent",18.75,18.8,18.8,255,{"$f":"VLOOKUP(B655,'2022emp'!$A$2:$B$633,2,FALSE)","v":9000},{"$f":"VLOOKUP(B655,'2022emp'!$A$2:$F$633,4,FALSE)","v":49000},{"$f":"VLOOKUP(B655,'2022emp'!$A$2:$H$633,7,FALSE)","v":9000},{"$f":"VLOOKUP(B655,'2022emp'!$A$2:$H$633,8,FALSE)","v":600},-20,18.367346938775512,"Very Manufacturing Dependent",18.399999999999999]
["Wales","Ynys Mon",2000,20000,10,120,115,115,5,5,"Virginia","Crosbie","Conservative","Hold","Virginia","Crosbie","Conservative",2000,175,"Same MP","Virginia Crosbie",null,"Manufacturing Dependent",10.714285714285714,10.7,10.7,125,{"$f":"VLOOKUP(B656,'2022emp'!$A$2:$B$633,2,FALSE)","v":2500},{"$f":"VLOOKUP(B656,'2022emp'!$A$2:$F$633,4,FALSE)","v":21000},{"$f":"VLOOKUP(B656,'2022emp'!$A$2:$H$633,7,FALSE)","v":2500},{"$f":"VLOOKUP(B656,'2022emp'!$A$2:$H$633,8,FALSE)","v":225},10,11.904761904761903,"Manufacturing Dependent",11.9]
["Yorkshire & the Humber","York Central",1000,58000,1.7241379310344827,95,105,105,-10,-10,"Rachael","Maskell","Labour/Co-operative","Hold","Rachael","Maskell","Labour/Co-operative",800,150,"Same MP","Rachael Maskell",null,"Not Manufacturing Dependent",1.4035087719298245,1.4,1.4,100,{"$f":"VLOOKUP(B657,'2022emp'!$A$2:$B$633,2,FALSE)","v":900},{"$f":"VLOOKUP(B657,'2022emp'!$A$2:$F$633,4,FALSE)","v":61000},{"$f":"VLOOKUP(B657,'2022emp'!$A$2:$H$633,7,FALSE)","v":700},{"$f":"VLOOKUP(B657,'2022emp'!$A$2:$H$633,8,FALSE)","v":175},-5,1.4754098360655739,"Not Manufacturing Dependent",1.5]
["Yorkshire & the Humber","York Outer",3000,48000,6.25,180,195,190,-10,-15,"Julian","Sturdy","Conservative","Hold","Julian","Sturdy","Conservative",3000,250,"Same MP","Julian Sturdy",null,"Not Manufacturing Dependent",8.3333333333333321,8.3000000000000007,8.3000000000000007,175,{"$f":"VLOOKUP(B658,'2022emp'!$A$2:$B$633,2,FALSE)","v":3000},{"$f":"VLOOKUP(B658,'2022emp'!$A$2:$F$633,4,FALSE)","v":49000},{"$f":"VLOOKUP(B658,'2022emp'!$A$2:$H$633,7,FALSE)","v":3000},{"$f":"VLOOKUP(B658,'2022emp'!$A$2:$H$633,8,FALSE)","v":250},-20,6.1224489795918364,"Not Manufacturing Dependent",6.1]
[null,"Column Total",null,null,{"$error":"#DIV/0!"},{"$f":"SUM(F9:F658)","v":140075},{"$f":"SUM(G9:G658)","v":136105},{"$f":"SUM(H9:H658)","v":137360},2715,3970,null,null,null,null,null,null,null,{"$f":"SUM(R629:R658)","v":93750},9950,null,null,null,null,null,null,null,null,null,null,null,null,null,{"$f":"AVERAGE(AG9:AG658)","v":8.9331155636828914}]
[]
[]
[]
[]
[]
[]
[]
[]
[]
[]
[]
[]
[]
[]
[]
[]
[]
[]
[]
[]
[]
[]
[]
[]
[]
[]
[]
[]
[]
[]
[]
[]
[null,null,null,null,null,null,null,null,null,null,"copied from last data"]

{"sheet":"Mfg Jobs By Party and Region","index":2,"n_rows":57,"n_cols":2,"rows_kept":57,"cut":false,"hidden":true,"merged":[[0,0,0,1]]}
["Manufacturing Jobs by Party and Region Summary Table"]
[]
["Row Labels","Sum of Mfg Employee count 2018"]
["East Midlands",263250]
["Conservative",206750]
["Labour",54000]
["Labour/Co-operative",2500]
["Eastern",212400]
["Conservative",192400]
["Labour",18000]
["Liberal Democrat",2000]
["London",110850]
["Conservative",30450]
["Labour",65550]
["Labour/Co-operative",11900]
["Liberal Democrat",2950]
["North East",114250]
["Conservative",38750]
["Labour",75500]
["North West",319725]
["Conservative",159750]
["Labour",135475]
["Labour/Co-operative",18500]
["Liberal Democrat",3500]
["Speaker",2500]
["Northern Ireland"]
["Scotland",178250]
["Conservative",26000]
["Independent",3500]
["Labour",500]
["Liberal Democrat",5400]
["Scottish National Party",142850]
["South East",260050]
["Conservative",238800]
["Green",900]
["Labour",12250]
["Labour/Co-operative",5600]
["Liberal Democrat",2500]
["South West",208700]
["Conservative",189200]
["Labour",11000]
["Labour/Co-operative",7000]
["Liberal Democrat",1500]
["Wales",142200]
["Conservative",44100]
["Labour",77850]
["Labour/Co-operative",13500]
["Plaid Cymru",6750]
["West Midlands",301050]
["Conservative",229250]
["Labour",69800]
["Labour/Co-operative",2000]
["Yorkshire & the Humber",284550]
["Conservative",142000]
["Labour",126250]
["Labour/Co-operative",16300]
["Grand Total",2395275]

{"sheet":"Cons Above average mfg","index":3,"n_rows":162,"n_cols":16,"rows_kept":162,"cut":false,"hidden":true,"merged":[]}
[]
[null,"Legend:","1x average","2x average","3x average"]
["parliamentary constituency 2010","Mfg Employee count 2018","Total Constit Employee count 2018","MFG job percent of total","2019 Business count","2014 Business Count","2018 Business count","1-Year Change Business Count","5-Year Change Business Count","First name","Last name","Party","Hold or Change","First name","Last name","Party"]
["Copeland",12000,38000,31.578947368421051,145,135,145,0,10,"Trudy","Harrison","Conservative","Hold","Trudy","Harrison","Conservative"]
["Pendle",10000,33000,30.303030303030305,285,280,290,-5,5,"Andrew","Stephenson","Conservative","Hold","Andrew","Stephenson","Conservative"]
["Kenilworth and Southam",12000,46000,26.086956521739129,265,265,260,5,0,"Jeremy","Wright","Conservative","Hold","Jeremy","Wright","Conservative"]
["Fylde",10000,39000,25.641025641025639,170,160,175,-5,10,"Mark","Menzies","Conservative","Hold","Mark","Menzies","Conservative"]
["Amber Valley",9000,38000,23.684210526315788,290,290,290,0,0,"Nigel","Mills","Conservative","Hold","Nigel","Mills","Conservative"]
["South Holland and The Deepings",9000,40000,22.5,210,210,215,-5,0,"John","Hayes","Conservative","Hold","John","Hayes","Conservative"]
["Rossendale and Darwen",6000,27000,22.222222222222221,290,285,300,-10,5,"Jake","Berry","Conservative","Hold","Jake","Berry","Conservative"]
["Redditch",9000,41000,21.951219512195124,340,360,335,5,-20,"Rachel","Maclean","Conservative","Hold","Rachel","Maclean","Conservative"]
["South Derbyshire",7000,32000,21.875,255,215,245,10,40,"Heather","Wheeler","Conservative","Hold","Heather","Wheeler","Conservative"]
["Cleethorpes",8000,39000,20.512820512820511,205,180,200,5,25,"Martin","Vickers","Conservative","Hold","Martin","Vickers","Conservative"]
["Thirsk and Malton",8000,39000,20.512820512820511,380,335,370,10,45,"Kevin","Hollinrake","Conservative","Hold","Kevin","Hollinrake","Conservative"]
["Tewkesbury",11000,54000,20.37037037037037,295,300,285,10,-5,"Laurence","Robertson","Conservative","Hold","Laurence","Robertson","Conservative"]
["Ribble Valley",12000,59000,20.33898305084746,325,300,320,5,25,"Nigel","Evans","Conservative","Hold","Nigel","Evans","Conservative"]
["Aldridge-Brownhills",5000,25000,20,250,225,240,10,25,"Wendy","Morton","Conservative","Hold","Wendy","Morton","Conservative"]
["Calder Valley",9000,45000,20,435,430,435,0,5,"Craig","Whittaker","Conservative","Hold","Craig","Whittaker","Conservative"]
["Dudley South",8000,40000,20,410,385,390,20,25,"Mike","Wood","Conservative","Hold","Mike","Wood","Conservative"]
["Erewash",7000,35000,20,375,350,385,-10,25,"Maggie","Throup","Conservative","Hold","Maggie","Throup","Conservative"]
["North East Derbyshire",5000,25000,20,220,210,210,10,10,"Lee","Rowley","Conservative","Hold","Lee","Rowley","Conservative"]
["Corby",10000,51000,19.607843137254903,335,300,320,15,35,"Tom","Pursglove","Conservative","Hold","Tom","Pursglove","Conservative"]
["Mid Worcestershire",8000,42000,19.047619047619047,320,290,295,25,30,"Nigel","Huddleston","Conservative","Hold","Nigel","Huddleston","Conservative"]
["Rutland and Melton",7000,37000,18.918918918918919,295,270,290,5,25,"Alicia","Kearns","Conservative","Hold","Alan","Duncan","Conservative"]
["East Yorkshire",6000,32000,18.75,280,270,280,0,10,"Greg","Knight","Conservative","Hold","Greg","Knight","Conservative"]
["Yeovil",9000,48000,18.75,295,265,275,20,30,"Marcus","Fysh","Conservative","Hold","Marcus","Fysh","Conservative"]
["Telford",10000,54000,18.518518518518519,300,290,300,0,10,"Lucy","Allan","Conservative","Hold","Lucy","Allan","Conservative"]
["North East Cambridgeshire",7000,38000,18.421052631578945,275,245,275,0,30,"Stephen","Barclay","Conservative","Hold","Stephen","Barclay","Conservative"]
["Montgomeryshire",4000,22000,18.181818181818183,190,180,190,0,10,"Craig","Williams","Conservative","Hold","Glyn","Davies","Conservative"]
["Banff and Buchan",6000,34000,17.647058823529413,320,285,310,10,35,"David","Duguid","Conservative","Hold","David","Duguid","Conservative"]
["Haltemprice and Howden",6000,34000,17.647058823529413,230,195,225,5,35,"David","Davis","Conservative","Hold","David","Davis","Conservative"]
["South West Norfolk",6000,34000,17.647058823529413,290,295,290,0,-5,"Elizabeth","Truss","Conservative","Hold","Elizabeth","Truss","Conservative"]
["Bosworth",7000,40000,17.5,390,400,400,-10,-10,"Luke","Evans","Conservative","Hold","David","Tredinnick","Conservative"]
["Stone",4500,26000,17.307692307692307,245,220,240,5,25,"Bill","Cash","Conservative","Hold","Bill","Cash","Conservative"]
["Halesowen and Rowley Regis",5000,29000,17.241379310344829,325,345,320,5,-20,"James","Morris","Conservative","Hold","James","Morris","Conservative"]
["Solihull",10000,58000,17.241379310344829,130,105,135,-5,25,"Julian","Knight","Conservative","Hold","Julian","Knight","Conservative"]
["Stoke-on-Trent South",5000,29000,17.241379310344829,195,200,200,-5,-5,"Jack Edgar","Brereton","Conservative","Hold","Jack","Brereton","Conservative"]
["North Warwickshire",11000,64000,17.1875,340,335,340,0,5,"Craig","Tracey","Conservative","Hold","Craig","Tracey","Conservative"]
["Moray",6000,35000,17.142857142857142,185,170,180,5,15,"Douglas","Ross","Conservative","Hold","Douglas","Ross","Conservative"]
["Selby and Ainsty",7000,42000,16.666666666666664,285,240,275,10,45,"Nigel","Adams","Conservative","Hold","Nigel","Adams","Conservative"]
["South Staffordshire",4500,27000,16.666666666666664,230,240,230,0,-10,"Gavin","Williamson","Conservative","Hold","Gavin","Williamson","Conservative"]
["Staffordshire Moorlands",4000,24000,16.666666666666664,215,195,210,5,20,"Karen","Bradley","Conservative","Hold","Karen","Bradley","Conservative"]
["Bolton West",6000,37000,16.216216216216218,215,200,200,15,15,"Chris","Green","Conservative","Hold","Chris","Green","Conservative"]
["Burton",9000,56000,16.071428571428573,260,245,260,0,15,"Kate","Griffiths","Conservative","Hold","Andrew","Griffiths","Conservative"]
["Forest of Dean",4000,25000,16,285,250,270,15,35,"Mark","Harper","Conservative","Hold","Mark","Harper","Conservative"]
["South Suffolk",5000,32000,15.625,295,290,290,5,5,"James","Cartlidge","Conservative","Hold","James","Cartlidge","Conservative"]
["South West Devon",5000,32000,15.625,185,180,190,-5,5,"Gary","Streeter","Conservative","Hold","Gary","Streeter","Conservative"]
["Wellingborough",7000,45000,15.555555555555555,330,335,335,-5,-5,"Peter","Bone","Conservative","Hold","Peter","Bone","Conservative"]
["Huntingdon",9000,58000,15.517241379310345,390,335,350,40,55,"Jonathan","Djanogly","Conservative","Hold","Jonathan","Djanogly","Conservative"]
["Mid Dorset and North Poole",4500,29000,15.517241379310345,270,275,275,-5,-5,"Michael","Tomlinson","Conservative","Hold","Michael","Tomlinson","Conservative"]
["Ludlow",4000,26000,15.384615384615385,300,275,295,5,25,"Philip","Dunne","Conservative","Hold","Philip","Dunne","Conservative"]
["North East Hertfordshire",6000,39000,15.384615384615385,330,330,330,0,0,"Oliver","Heald","Conservative","Hold","Oliver","Heald","Conservative"]
["Charnwood",5000,33000,15.151515151515152,280,260,285,-5,20,"Edward","Argar","Conservative","Hold","Edward","Argar","Conservative"]
["East Worthing and Shoreham",5000,33000,15.151515151515152,235,215,250,-15,20,"Tim","Loughton","Conservative","Hold","Tim","Loughton","Conservative"]
["Sittingbourne and Sheppey",6000,40000,15,265,230,250,15,35,"Gordon","Henderson","Conservative","Hold","Gordon","Henderson","Conservative"]
["North Herefordshire",4000,27000,14.814814814814813,310,310,320,-10,0,"Bill","Wiggin","Conservative","Hold","Bill","Wiggin","Conservative"]
["Waveney",5000,34000,14.705882352941178,210,205,205,5,5,"Peter","Aldous","Conservative","Hold","Peter","Aldous","Conservative"]
["West Worcestershire",5000,34000,14.705882352941178,370,355,365,5,15,"Harriett","Baldwin","Conservative","Hold","Harriett","Baldwin","Conservative"]
["Hereford and South Herefordshire",7000,48000,14.583333333333334,280,275,285,-5,5,"Jesse","Norman","Conservative","Hold","Jesse","Norman","Conservative"]
["Broadland",4500,31000,14.516129032258066,315,300,310,5,15,"Jerome","Mayhew","Conservative","Hold","Keith","Simpson","Conservative"]
["Louth and Horncastle",4000,28000,14.285714285714285,215,220,220,-5,-5,"Victoria","Atkins","Conservative","Hold","Victoria","Atkins","Conservative"]
["Northampton North",5000,35000,14.285714285714285,160,155,160,0,5,"Michael","Ellis","Conservative","Hold","Michael","Ellis","Conservative"]
["Sleaford and North Hykeham",6000,42000,14.285714285714285,265,255,270,-5,10,"Caroline","Johnson","Conservative","Hold","Caroline","Johnson","Conservative"]
["West Suffolk",6000,42000,14.285714285714285,325,335,340,-15,-10,"Matthew","Hancock","Conservative","Hold","Matthew","Hancock","Conservative"]
["South East Cambridgeshire",8000,57000,14.035087719298245,575,310,370,205,265,"Lucy","Frazer","Conservative","Hold","Lucy","Frazer","Conservative"]
["Gainsborough",3500,25000,14.000000000000002,220,195,215,5,25,"Edward","Leigh","Conservative","Hold","Edward","Leigh","Conservative"]
["Chippenham",6000,43000,13.953488372093023,240,215,240,0,25,"Michelle","Donelan","Conservative","Hold","Michelle","Donelan","Conservative"]
["Lichfield",6000,43000,13.953488372093023,275,255,270,5,20,"Michael","Fabricant","Conservative","Hold","Michael","Fabricant","Conservative"]
["Derbyshire Dales",5000,36000,13.888888888888889,295,270,300,-5,25,"Sarah Elizabeth","Dines","Conservative","Hold","Patrick","McLoughlin","Conservative"]
["Congleton",4500,33000,13.636363636363635,285,250,280,5,35,"Fiona","Bruce","Conservative","Hold","Fiona","Bruce","Conservative"]
["Loughborough",6000,44000,13.636363636363635,270,255,340,-70,15,"Jane","Hunt","Conservative","Hold","Nicky","Morgan","Conservative"]
["Tiverton and Honiton",4500,33000,13.636363636363635,335,290,325,10,45,"Neil","Parish","Conservative","Hold","Neil","Parish","Conservative"]
["Somerton and Frome",5000,37000,13.513513513513514,360,375,370,-10,-15,"David","Warburton","Conservative","Hold","David","Warburton","Conservative"]
["North Swindon",7000,52000,13.461538461538462,185,170,175,10,15,"Justin","Tomlinson","Conservative","Hold","Justin","Tomlinson","Conservative"]
["Beverley and Holderness",4500,34000,13.23529411764706,230,205,240,-10,25,"Graham","Stuart","Conservative","Hold","Graham","Stuart","Conservative"]
["Walsall North",4500,34000,13.23529411764706,290,315,300,-10,-25,"Eddie","Hughes","Conservative","Hold","Eddie","Hughes","Conservative"]
["North Shropshire",5000,38000,13.157894736842104,285,245,285,0,40,"Owen","Paterson","Conservative","Hold","Owen","Paterson","Conservative"]
["Tamworth",5000,38000,13.157894736842104,295,295,290,5,0,"Christopher","Pincher","Conservative","Hold","Christopher","Pincher","Conservative"]
["North West Leicestershire",8000,61000,13.114754098360656,325,275,310,15,50,"Andrew","Bridgen","Conservative","Hold","Andrew","Bridgen","Conservative"]
["Brigg and Goole",4000,31000,12.903225806451612,205,180,195,10,25,"Andrew","Percy","Conservative","Hold","Andrew","Percy","Conservative"]
["Scarborough and Whitby",5000,39000,12.820512820512819,190,165,190,0,25,"Robert","Goodwill","Conservative","Hold","Robert","Goodwill","Conservative"]
["Poole",7000,55000,12.727272727272727,285,280,290,-5,5,"Robert","Syms","Conservative","Hold","Robert","Syms","Conservative"]
["Berwickshire, Roxburgh and Selkirk",4500,36000,12.5,235,215,215,20,20,"John","Lamont","Conservative","Hold","John","Lamont","Conservative"]
["Gosport",3000,24000,12.5,195,165,205,-10,30,"Caroline","Dinenage","Conservative","Hold","Caroline","Dinenage","Conservative"]
["North Dorset",4000,32000,12.5,370,355,350,20,15,"Simon","Hoare","Conservative","Hold","Simon","Hoare","Conservative"]
["South West Bedfordshire",6000,48000,12.5,310,280,310,0,30,"Andrew","Selous","Conservative","Hold","Andrew","Selous","Conservative"]
["Stevenage",6000,48000,12.5,165,165,175,-10,0,"Stephen","McPartland","Conservative","Hold","Stephen","McPartland","Conservative"]
["The Wrekin",4500,36000,12.5,150,140,150,0,10,"Mark","Pritchard","Conservative","Hold","Mark","Pritchard","Conservative"]
["Witham",4500,36000,12.5,245,245,260,-15,0,"Priti","Patel","Conservative","Hold","Priti","Patel","Conservative"]
["Wyre Forest",4000,32000,12.5,255,245,250,5,10,"Mark","Garnier","Conservative","Hold","Mark","Garnier","Conservative"]
["Filton and Bradley Stoke",11000,89000,12.359550561797752,130,125,135,-5,5,"Jack","Lopresti","Conservative","Hold","Jack","Lopresti","Conservative"]
["Daventry",6000,49000,12.244897959183673,345,330,345,0,15,"Chris","Heaton-Harris","Conservative","Hold","Chris","Heaton-Harris","Conservative"]
["North West Norfolk",5000,41000,12.195121951219512,215,205,220,-5,10,"James","Wild","Conservative","Hold","Henry","Bellingham","Conservative"]
["Christchurch",4500,37000,12.162162162162163,295,265,285,10,30,"Christopher","Chope","Conservative","Hold","Christopher","Chope","Conservative"]
["Mid Norfolk",4000,33000,12.121212121212121,260,250,265,-5,10,"George","Freeman","Conservative","Hold","George","Freeman","Conservative"]
["Central Devon",3500,29000,12.068965517241379,315,295,320,-5,20,"Mel","Stride","Conservative","Hold","Mel","Stride","Conservative"]
["Dumfriesshire, Clydesdale and Tweeddale",3500,29000,12.068965517241379,195,175,190,5,20,"David","Mundell","Conservative","Hold","David","Mundell","Conservative"]
["Cannock Chase",5000,42000,11.904761904761903,305,295,305,0,10,"Amanda","Milling","Conservative","Hold","Amanda","Milling","Conservative"]
["Hazel Grove",2500,21000,11.904761904761903,210,185,190,20,25,"William","Wragg","Conservative","Hold","William","Wragg","Conservative"]
["North Devon",5000,42000,11.904761904761903,215,210,220,-5,5,"Selaine","Saxby","Conservative","Hold","Peter","Heaton-Jones","Conservative"]
["North West Hampshire",5000,42000,11.904761904761903,285,295,295,-10,-10,"Kit","Malthouse","Conservative","Hold","Kit","Malthouse","Conservative"]
["Harborough",4500,38000,11.842105263157894,340,340,330,10,0,"Neil","O'Brien","Conservative","Hold","Neil","O'Brien","Conservative"]
["Pudsey",4000,34000,11.76470588235294,225,220,220,5,5,"Stuart","Andrew","Conservative","Hold","Stuart","Andrew","Conservative"]
["Shipley",3500,30000,11.666666666666666,190,200,195,-5,-10,"Philip","Davies","Conservative","Hold","Philip","Davies","Conservative"]
["Newark",5000,43000,11.627906976744185,270,245,270,0,25,"Robert","Jenrick","Conservative","Hold","Robert","Jenrick","Conservative"]
["Braintree",4000,35000,11.428571428571429,355,330,360,-5,25,"James","Cleverly","Conservative","Hold","James","Cleverly","Conservative"]
["Banbury",7000,63000,11.111111111111111,285,280,290,-5,5,"Victoria","Prentis","Conservative","Hold","Victoria","Prentis","Conservative"]
["Boston and Skegness",5000,45000,11.111111111111111,210,185,210,0,25,"Matt","Warman","Conservative","Hold","Matt","Warman","Conservative"]
["Carlisle",5000,45000,11.111111111111111,115,125,120,-5,-10,"John","Stevenson","Conservative","Hold","John","Stevenson","Conservative"]
["Central Suffolk and North Ipswich",4000,36000,11.111111111111111,255,270,260,-5,-15,"Daniel","Poulter","Conservative","Hold","Daniel","Poulter","Conservative"]
["Plymouth, Moor View",4000,36000,11.111111111111111,100,90,95,5,10,"Johnny","Mercer","Conservative","Hold","Johnny","Mercer","Conservative"]
["South West Wiltshire",5000,45000,11.111111111111111,255,245,240,15,10,"Andrew","Murrison","Conservative","Hold","Andrew","Murrison","Conservative"]
["Witney",5000,45000,11.111111111111111,255,275,260,-5,-20,"Robert Alexander","Courts","Conservative","Hold","Robert","Courts","Conservative"]
["Kettering",5000,46000,10.869565217391305,255,245,265,-10,10,"Philip","Hollobone","Conservative","Hold","Philip","Hollobone","Conservative"]
["Skipton and Ripon",5000,47000,10.638297872340425,315,305,325,-10,10,"Julian","Smith","Conservative","Hold","Julian","Smith","Conservative"]
["Havant",3500,33000,10.606060606060606,190,185,180,10,5,"Alan","Mak","Conservative","Hold","Alan","Mak","Conservative"]
["East Hampshire",4000,38000,10.526315789473683,305,290,300,5,15,"Damian","Hinds","Conservative","Hold","Damian","Hinds","Conservative"]
["Bridgwater and West Somerset",4500,43000,10.465116279069768,245,245,240,5,0,"Ian","Liddell-Grainger","Conservative","Hold","Ian","Liddell-Grainger","Conservative"]
["South East Cornwall",2500,24000,10.416666666666668,195,170,200,-5,25,"Sheryll","Murray","Conservative","Hold","Sheryll","Murray","Conservative"]
["Stafford",5000,48000,10.416666666666668,190,200,195,-5,-10,"Theo","Clarke","Conservative","Hold","Jeremy","Lefroy","Conservative"]
["The Cotswolds",5000,48000,10.416666666666668,350,325,345,5,25,"Geoffrey","Clifton-Brown","Conservative","Hold","Geoffrey","Clifton-Brown","Conservative"]
["South Ribble",3000,29000,10.344827586206897,220,230,225,-5,-10,"Katherine","Fletcher","Conservative","Hold","Seema","Kennedy","Conservative"]
["Vale of Glamorgan",3000,29000,10.344827586206897,190,180,185,5,10,"Alun","Cairns","Conservative","Hold","Alun","Cairns","Conservative"]
["Fareham",4500,44000,10.227272727272728,280,260,285,-5,20,"Suella","Braverman","Conservative","Hold","Suella","Braverman","Conservative"]
["Isle of Wight",5000,50000,10,325,250,300,25,75,"Bob","Seely","Conservative","Hold","Bob","Seely","Conservative"]
["Maldon",3000,30000,10,330,315,330,0,15,"John","Whittingdale","Conservative","Hold","John","Whittingdale","Conservative"]
["Mansfield",4000,40000,10,190,180,200,-10,10,"Ben","Bradley","Conservative","Hold","Ben","Bradley","Conservative"]
["North Cornwall",3500,35000,10,255,215,230,25,40,"Scott","Mann","Conservative","Hold","Scott","Mann","Conservative"]
["Portsmouth North",6000,60000,10,235,210,245,-10,25,"Penny","Mordaunt","Conservative","Hold","Penny","Mordaunt","Conservative"]
["Sherwood",3000,30000,10,250,225,255,-5,25,"Mark","Spencer","Conservative","Hold","Mark","Spencer","Conservative"]
["Wells",4500,45000,10,295,320,310,-15,-25,"James","Heappey","Conservative","Hold","James","Heappey","Conservative"]
["New Forest East",3500,36000,9.7222222222222232,215,200,215,0,15,"Julian","Lewis","Conservative","Hold","Julian","Lewis","Conservative"]
["Ashford",5000,53000,9.433962264150944,305,315,310,-5,-10,"Damian","Green","Conservative","Hold","Damian","Green","Conservative"]
["Devizes",3000,32000,9.375,215,205,205,10,10,"Danny","Kruger","Conservative","Hold","Claire","Perry","Conservative"]
["Meon Valley",4500,48000,9.375,335,290,320,15,45,"Flick","Drummond","Conservative","Hold","George","Hollingbery","Conservative"]
["Richmond (Yorks)",4000,43000,9.3023255813953494,260,230,260,0,30,"Rishi","Sunak","Conservative","Hold","Rishi","Sunak","Conservative"]
["Rugby",4000,43000,9.3023255813953494,230,210,230,0,20,"Mark","Pawsey","Conservative","Hold","Mark","Pawsey","Conservative"]
["Worcester",5000,54000,9.2592592592592595,160,170,170,-10,-10,"Robin","Walker","Conservative","Hold","Robin","Walker","Conservative"]
["Woking",4500,49000,9.183673469387756,210,185,215,-5,25,"Jonathan","Lord","Conservative","Hold","Jonathan","Lord","Conservative"]
["Eastleigh",5000,55000,9.0909090909090917,300,250,300,0,50,"Paul","Holmes","Conservative","Hold","Mims","Davies","Conservative"]
["New Forest West",3000,33000,9.0909090909090917,280,260,270,10,20,"Desmond","Swayne","Conservative","Hold","Desmond","Swayne","Conservative"]
["North Somerset",4000,44000,9.0909090909090917,225,225,235,-10,0,"Liam","Fox","Conservative","Hold","Liam","Fox","Conservative"]
["Rochford and Southend East",4000,44000,9.0909090909090917,250,240,250,0,10,"James","Duddridge","Conservative","Hold","James","Duddridge","Conservative"]
["Hexham",2250,25000,9,155,160,150,5,-5,"Guy","Opperman","Conservative","Hold","Guy","Opperman","Conservative"]
["Bury St Edmunds",6000,67000,8.9552238805970141,235,250,235,0,-15,"Jo","Churchill","Conservative","Hold","Jo","Churchill","Conservative"]
["Chichester",5000,56000,8.9285714285714288,345,335,345,0,10,"Gillian","Keegan","Conservative","Hold","Gillian","Keegan","Conservative"]
["Torridge and West Devon",2500,28000,8.9285714285714288,215,225,230,-15,-10,"Geoffrey","Cox","Conservative","Hold","Geoffrey","Cox","Conservative"]
["Monmouth",3000,34000,8.8235294117647065,195,165,190,5,30,"David","Davies","Conservative","Hold","David","Davies","Conservative"]
["Rayleigh and Wickford",2000,23000,8.695652173913043,295,285,290,5,10,"Mark","Francois","Conservative","Hold","Mark","Francois","Conservative"]
["West Aberdeenshire and Kincardine",3500,41000,8.536585365853659,250,195,240,10,55,"Andrew","Bowie","Conservative","Hold","Andrew","Bowie","Conservative"]
["Suffolk Coastal",4000,47000,8.5106382978723403,220,220,215,5,0,"Therese","Coffey","Conservative","Hold","Therese","Coffey","Conservative"]
["Broxbourne",3000,36000,8.3333333333333321,230,230,235,-5,0,"Charles","Walker","Conservative","Hold","Charles","Walker","Conservative"]
["Chatham and Aylesford",2500,30000,8.3333333333333321,145,130,150,-5,15,"Tracey","Crouch","Conservative","Hold","Tracey","Crouch","Conservative"]
["Faversham and Mid Kent",3000,36000,8.3333333333333321,250,210,250,0,40,"Helen","Whately","Conservative","Hold","Helen","Whately","Conservative"]
["Macclesfield",3500,42000,8.3333333333333321,255,235,260,-5,20,"David","Rutley","Conservative","Hold","David","Rutley","Conservative"]
["Newton Abbot",2500,30000,8.3333333333333321,205,190,200,5,15,"Anne Marie","Morris","Conservative","Hold","Anne Marie","Morris","Conservative"]
["Norwich North",3500,42000,8.3333333333333321,160,165,170,-10,-5,"Chloe","Smith","Conservative","Hold","Chloe","Smith","Conservative"]
["Rochester and Strood",4500,54000,8.3333333333333321,265,265,265,0,0,"Kelly","Tolhurst","Conservative","Hold","Kelly","Tolhurst","Conservative"]
["Wealden",3000,36000,8.3333333333333321,330,325,345,-15,5,"Nusrat","Ghani","Conservative","Hold","Nusrat","Ghani","Conservative"]
["York Outer",4000,48000,8.3333333333333321,190,180,195,-5,10,"Julian","Sturdy","Conservative","Hold","Julian","Sturdy","Conservative"]
["Basildon and Billericay",4500,55000,8.1818181818181817,255,240,255,0,15,"John","Baron","Conservative","Hold","John","Baron","Conservative"]
["South Norfolk",3500,43000,8.1395348837209305,275,240,265,10,35,"Richard","Bacon","Conservative","Hold","Richard","Bacon","Conservative"]

{"sheet":"2022emp","index":4,"n_rows":633,"n_cols":8,"rows_kept":633,"cut":false,"hidden":true,"merged":[]}
["Constit","MfgEMp","%of Emp","Emp","Ft","Pt","FtMFG","PtMFG"]
["Aberavon",7000,20.6,34000,24000,10000,7000,350]
["Aberconwy",600,2.7,22000,12000,9000,500,75]
["Aberdeen North",700,1,69000,42000,27000,600,75]
["Aberdeen South",3000,5.4,56000,41000,14000,2500,350]
["Airdrie and Shotts",2500,7.4,34000,25000,9000,2250,250]
["Aldershot",3000,4.8,63000,46000,17000,2500,300]
["Aldridge-Brownhills",4500,18.8,24000,16000,8000,4000,500]
["Altrincham and Sale West",1250,1.7,74000,55000,19000,1000,150]
["Alyn and Deeside",13000,27.1,48000,35000,12000,13000,500]
["Amber Valley",8000,21.1,38000,27000,11000,7000,600]
["Angus",4500,16.100000000000001,28000,19000,9000,4000,350]
["Arfon",1750,5.5,32000,19000,13000,1750,150]
["Argyll and Bute",1750,4.9000000000000004,36000,24000,12000,1500,250]
["Arundel and South Downs",2500,6.9,36000,22000,14000,2250,400]
["Ashfield",8000,15.1,53000,36000,17000,7000,500]
["Ashford",4500,7.8,58000,39000,19000,3500,700]
["Ashton-under-Lyne",3000,8.3000000000000007,36000,25000,12000,3000,250]
["Aylesbury",3000,5.2,58000,41000,17000,2500,300]
["Ayr, Carrick and Cumnock",1750,5.3,33000,20000,13000,1500,225]
["Banbury",7000,10.3,68000,46000,22000,6000,600]
["Banff and Buchan",6000,17.600000000000001,34000,22000,11000,5000,800]
["Barking",1750,4.5,39000,26000,13000,1500,350]
["Barnsley Central",4500,10.7,42000,28000,15000,4000,350]
["Barnsley East",6000,24,25000,17000,8000,5000,400]
["Barrow and Furness",12000,31.6,38000,27000,11000,11000,450]
["Basildon and Billericay",7000,12.1,58000,42000,17000,6000,500]
["Basingstoke",3000,4.5,67000,50000,18000,3000,400]
["Bassetlaw",8000,18.2,44000,30000,14000,7000,900]
["Bath",1250,2.1,60000,36000,25000,1000,250]
["Batley and Spen",9000,20.9,43000,28000,14000,8000,1000]
["Battersea",1000,2,50000,35000,14000,900,150]
["Beaconsfield",3000,4.9000000000000004,61000,44000,17000,2500,400]
["Beckenham",400,1.7,24000,14000,9000,350,50]
["Bedford",4500,7.9,57000,40000,17000,4000,400]
["Bermondsey and Old Southwark",1750,0.7,245000,201000,44000,1500,225]
["Berwickshire, Roxburgh and Selkirk",3500,9.6999999999999993,36000,23000,13000,3500,450]
["Berwick-upon-Tweed",1250,5.7,22000,13000,9000,1250,175]
["Bethnal Green and Bow",1250,1.2,104000,77000,27000,1000,250]
["Beverley and Holderness",5000,14.3,35000,22000,13000,5000,300]
["Bexhill and Battle",1500,5,30000,19000,11000,1250,250]
["Bexleyheath and Crayford",1250,4.3,29000,18000,10000,1250,125]
["Birkenhead",3000,8.6,35000,23000,12000,2500,300]
["Birmingham, Edgbaston",1750,2.4,72000,54000,19000,1500,250]
["Birmingham, Erdington",3500,10.6,33000,22000,10000,3000,300]
["Birmingham, Hall Green",1750,6.7,26000,16000,10000,1250,350]
["Birmingham, Hodge Hill",2000,7.4,27000,18000,9000,1750,250]
["Birmingham, Ladywood",12000,5,241000,174000,67000,10000,1750]
["Birmingham, Northfield",1500,6,25000,16000,9000,1250,225]
["Birmingham, Perry Barr",3000,11.1,27000,19000,9000,3000,400]
["Birmingham, Selly Oak",1250,5.2,24000,15000,9000,1250,175]
["Birmingham, Yardley",4500,13.6,33000,23000,10000,4000,600]
["Bishop Auckland",4500,15,30000,20000,10000,4500,225]
["Blackburn",7000,11.7,60000,41000,19000,6000,1000]
["Blackley and Broughton",1500,3.3,45000,30000,15000,1250,250]
["Blackpool North and Cleveleys",2250,7.3,31000,19000,11000,2000,200]
["Blackpool South",3000,7.7,39000,24000,15000,3000,250]
["Blaenau Gwent",4500,20.5,22000,16000,6000,4500,300]
["Blaydon",3500,12.5,28000,17000,11000,3500,225]
["Blyth Valley",6000,20.7,29000,21000,9000,5000,350]
["Bognor Regis and Littlehampton",2250,7.3,31000,20000,11000,2000,300]
["Bolsover",6000,15.8,38000,27000,11000,5000,600]
["Bolton North East",3000,8.1,37000,24000,13000,2500,350]
["Bolton South East",5000,10.6,47000,33000,15000,4500,500]
["Bolton West",5000,13.2,38000,27000,11000,5000,300]
["Bootle",3000,7.7,39000,27000,12000,2500,300]
["Boston and Skegness",4500,10.199999999999999,44000,28000,17000,4500,400]
["Bosworth",6000,14.6,41000,30000,11000,5000,450]
["Bournemouth East",350,0.9,40000,24000,17000,300,50]
["Bournemouth West",2000,3.3,60000,39000,21000,1750,175]
["Bracknell",1750,3.4,51000,36000,15000,1500,150]
["Bradford East",4000,11.1,36000,24000,12000,4000,350]
["Bradford South",7000,18.399999999999999,38000,28000,10000,6000,500]
["Bradford West",5000,7.5,67000,45000,23000,4000,600]
["Braintree",3500,10.3,34000,22000,11000,3000,400]
["Brecon and Radnorshire",1750,7,25000,16000,9000,1750,150]
["Brent Central",7000,11.7,60000,44000,15000,6000,700]
["Brent North",2000,3.9,51000,34000,18000,1750,175]
["Brentford and Isleworth",1750,1.6,110000,75000,35000,1500,150]
["Brentwood and Ongar",1500,3.7,41000,26000,14000,1250,225]
["Bridgend",3500,8.8000000000000007,40000,26000,14000,3500,200]
["Bridgwater and West Somerset",5000,10.4,48000,34000,14000,4500,400]
["Brigg and Goole",4500,15.5,29000,19000,10000,4000,500]
["Brighton, Kemptown",600,1.6,38000,22000,15000,500,75]
["Brighton, Pavilion",1250,1.7,72000,47000,26000,900,200]
["Bristol East",2500,8.6,29000,18000,11000,2250,300]
["Bristol North West",2000,3.8,53000,34000,19000,1750,150]
["Bristol South",3500,9.1999999999999993,38000,24000,14000,3000,350]
["Bristol West",2500,1.4,178000,125000,53000,2250,400]
["Broadland",4500,13.6,33000,23000,10000,4000,400]
["Bromley and Chislehurst",350,0.9,40000,25000,14000,300,75]
["Bromsgrove",3000,6.2,48000,33000,15000,2500,400]
["Broxbourne",2500,6.8,37000,25000,12000,2250,350]
["Broxtowe",4000,12.5,32000,21000,11000,3500,250]
["Buckingham",5000,13.2,38000,27000,11000,4500,500]
["Burnley",6000,15.4,39000,27000,12000,5000,350]
["Burton",11000,19.3,57000,41000,16000,9000,1500]
["Bury North",3500,9.1999999999999993,38000,25000,13000,3500,300]
["Bury South",3500,11.3,31000,21000,10000,3500,400]
["Bury St Edmunds",5000,6.8,73000,52000,21000,5000,600]
["Caerphilly",4500,14.5,31000,21000,10000,4500,300]
["Caithness, Sutherland and Easter Ross",2000,8.6999999999999993,23000,15000,8000,1750,175]
["Calder Valley",8000,18.2,44000,30000,14000,7000,700]
["Camberwell and Peckham",800,2.2000000000000002,36000,25000,11000,600,175]
["Camborne and Redruth",3000,8.6,35000,23000,12000,3000,250]
["Cambridge",1500,1.7,88000,62000,27000,1250,225]
["Cannock Chase",3500,8.5,41000,28000,13000,3000,450]
["Canterbury",1250,2.2000000000000002,57000,35000,21000,1250,200]
["Cardiff Central",900,1.2,78000,52000,26000,800,100]
["Cardiff North",2500,5.0999999999999996,49000,33000,15000,2000,450]
["Cardiff South and Penarth",4500,5.8,77000,56000,21000,4000,300]
["Cardiff West",1250,4.3,29000,18000,11000,1000,125]
["Carlisle",4500,10,45000,28000,17000,4500,350]
["Carmarthen East and Dinefwr",3000,15,20000,13000,7000,2500,300]
["Carmarthen West and South Pembrokeshire",1750,4.9000000000000004,36000,22000,14000,1500,125]
["Carshalton and Wallington",1250,3.3,38000,22000,15000,1250,125]
["Castle Point",1500,6.8,22000,13000,9000,1250,225]
["Central Ayrshire",6000,16.2,37000,24000,13000,5000,1250]
["Central Devon",3500,11.7,30000,20000,10000,3000,350]
["Central Suffolk and North Ipswich",3500,9.6999999999999993,36000,24000,12000,3000,350]
["Ceredigion",1000,3.7,27000,15000,11000,1000,100]
["Charnwood",6000,15,40000,27000,13000,5000,700]
["Chatham and Aylesford",2500,6.9,36000,23000,12000,2250,200]
["Cheadle",3000,5.9,51000,33000,18000,2500,225]
["Chelmsford",2500,4.2,60000,40000,20000,2250,300]
["Chelsea and Fulham",800,1.2,69000,49000,20000,700,150]
["Cheltenham",2250,4.0999999999999996,55000,34000,21000,2000,250]
["Chesham and Amersham",2000,6.1,33000,22000,11000,1750,225]
["Chesterfield",3500,7.3,48000,31000,16000,3000,350]
["Chichester",6000,10.9,55000,35000,20000,5000,600]
["Chingford and Woodford Green",300,1,31000,22000,9000,250,50]
["Chippenham",6000,14,43000,29000,14000,5000,400]
["Chipping Barnet",400,1.1000000000000001,35000,23000,12000,300,100]
["Chorley",2500,6.9,36000,24000,12000,2250,300]
["Christchurch",5000,14.3,35000,23000,12000,4500,600]
["Cities of London and Westminster",15000,1.1000000000000001,1345000,1113000,232000,13000,2000]
["City of Chester",1500,2.1,72000,48000,24000,1500,150]
["City of Durham",1500,2.8,54000,36000,18000,1250,225]
["Clacton",1250,5.7,22000,13000,10000,1000,175]
["Cleethorpes",9000,23.7,38000,28000,10000,9000,400]
["Clwyd South",3500,21.9,16000,10000,6000,3000,300]
["Clwyd West",1250,4.8,26000,15000,10000,1000,125]
["Coatbridge, Chryston and Bellshill",4500,10.5,43000,31000,11000,4000,400]
["Colchester",3000,5.3,57000,38000,20000,2500,450]
["Colne Valley",5000,17.2,29000,19000,10000,4500,400]
["Congleton",3500,10.6,33000,23000,11000,3500,400]
["Copeland",11000,29.7,37000,27000,10000,10000,700]
["Corby",8000,15.1,53000,39000,14000,8000,800]
["Coventry North East",5000,9.4,53000,35000,18000,4500,500]
["Coventry North West",2000,8,25000,16000,9000,2000,100]
["Coventry South",8000,9.4,85000,59000,25000,7000,800]
["Crawley",6000,7.1,85000,62000,23000,6000,400]
["Crewe and Nantwich",8000,14.3,56000,41000,16000,8000,500]
["Croydon Central",500,0.9,54000,41000,13000,450,75]
["Croydon North",900,2.2999999999999998,39000,25000,14000,800,100]
["Croydon South",800,2.6,31000,21000,10000,700,75]
["Cumbernauld, Kilsyth and Kirkintilloch East",4000,13.3,30000,21000,9000,3500,400]
["Cynon Valley",2250,14.1,16000,10000,6000,2000,350]
["Dagenham and Rainham",3500,10,35000,25000,10000,3500,200]
["Darlington",3500,8.3000000000000007,42000,29000,13000,3000,350]
["Dartford",3500,5,70000,47000,23000,2500,700]
["Daventry",6000,12.2,49000,36000,12000,5000,450]
["Delyn",6000,25,24000,16000,8000,5000,350]
["Denton and Reddish",5000,19.2,26000,18000,8000,4500,500]
["Derby North",2500,5.0999999999999996,49000,31000,18000,2000,300]
["Derby South",19000,24.4,78000,57000,21000,18000,700]
["Derbyshire Dales",5000,13.9,36000,22000,14000,4500,450]
["Devizes",3000,9.4,32000,21000,11000,2500,300]
["Dewsbury",8000,22.2,36000,23000,12000,7000,900]
["Don Valley",4000,11.8,34000,23000,11000,3500,350]
["Doncaster Central",6000,8,75000,50000,25000,6000,400]
["Doncaster North",1250,5.2,24000,15000,8000,1250,175]
["Dover",2250,8,28000,19000,9000,2000,150]
["Dudley North",2000,6.5,31000,19000,12000,1750,200]
["Dudley South",8000,20.5,39000,26000,13000,7000,1000]
["Dulwich and West Norwood",900,2.2999999999999998,39000,28000,11000,800,150]
["Dumfries and Galloway",2500,6.9,36000,22000,14000,2000,350]
["Dumfriesshire, Clydesdale and Tweeddale",3500,12.5,28000,18000,10000,3000,300]
["Dundee East",1500,6,25000,16000,9000,1500,100]
["Dundee West",2000,3.5,57000,36000,21000,1750,300]
["Dunfermline and West Fife",3500,8,44000,31000,13000,3500,200]
["Dwyfor Meirionnydd",1750,8.3000000000000007,21000,12000,9000,1500,175]
["Ealing Central and Acton",6000,9.1999999999999993,65000,47000,19000,5000,450]
["Ealing North",2250,6.8,33000,23000,10000,2000,400]
["Ealing, Southall",3000,10,30000,20000,10000,2500,300]
["Easington",4000,16,25000,17000,8000,3500,350]
["East Devon",2500,4.3,58000,38000,19000,2250,250]
["East Dunbartonshire",900,4.3,21000,13000,7000,800,100]
["East Ham",2250,5.2,43000,30000,13000,2000,225]
["East Hampshire",4000,10.3,39000,26000,12000,3500,450]
["East Kilbride, Strathaven and Lesmahagow",4000,10.3,39000,27000,12000,3500,300]
["East Lothian",2000,6.1,33000,21000,12000,1750,150]
["East Renfrewshire",500,2.4,21000,13000,8000,450,75]
["East Surrey",1000,2.2999999999999998,43000,28000,15000,800,125]
["East Worthing and Shoreham",4500,14.1,32000,22000,11000,4000,450]
["East Yorkshire",6000,17.600000000000001,34000,22000,12000,6000,450]
["Eastbourne",1750,4.5,39000,24000,15000,1500,175]
["Eastleigh",4500,8.3000000000000007,54000,36000,18000,4000,400]
["Eddisbury",4000,9.5,42000,29000,14000,3500,400]
["Edinburgh East",1000,1.2,85000,54000,31000,900,175]
["Edinburgh North and Leith",4500,4.2,108000,75000,33000,4000,400]
["Edinburgh South",300,1.2,26000,16000,10000,250,50]
["Edinburgh South West",1750,2.2999999999999998,77000,59000,17000,1500,175]
["Edinburgh West",1250,2.2000000000000002,57000,42000,15000,1000,150]
["Edmonton",2250,6.2,36000,24000,12000,2000,400]
["Ellesmere Port and Neston",6000,16.7,36000,24000,12000,5000,250]
["Elmet and Rothwell",2500,6.6,38000,25000,13000,2250,250]
["Eltham",125,0.6,20000,12000,8000,100,20]
["Enfield North",2500,5.8,43000,29000,15000,2000,500]
["Enfield, Southgate",450,1.5,31000,19000,11000,350,75]
["Epping Forest",1500,3.7,41000,27000,14000,1250,200]
["Epsom and Ewell",500,1.3,39000,24000,15000,450,75]
["Erewash",6000,17.100000000000001,35000,23000,12000,6000,700]
["Erith and Thamesmead",2500,7.8,32000,22000,10000,2500,250]
["Esher and Walton",1750,4.2,42000,27000,15000,1500,200]
["Exeter",1250,1.7,74000,48000,26000,1250,200]
["Falkirk",3000,6.2,48000,27000,21000,2500,300]
["Fareham",4000,9.1,44000,31000,13000,3500,350]
["Faversham and Mid Kent",2250,6.1,37000,25000,11000,2000,350]
["Feltham and Heston",1750,3.4,52000,39000,13000,1500,200]
["Filton and Bradley Stoke",11000,11.2,98000,73000,25000,11000,350]
["Finchley and Golders Green",700,1.3,53000,36000,18000,600,125]
["Folkestone and Hythe",2000,4.9000000000000004,41000,28000,13000,1750,225]
["Forest of Dean",4000,16,25000,16000,9000,3500,350]
["Fylde",10000,24.4,41000,30000,11000,9000,600]
["Gainsborough",3500,13,27000,18000,9000,3000,300]
["Garston and Halewood",9000,19.600000000000001,46000,35000,11000,8000,350]
["Gateshead",6000,10.7,56000,41000,15000,5000,400]
["Gedling",3000,11.5,26000,16000,10000,2500,250]
["Gillingham and Rainham",1750,5.8,30000,19000,11000,1750,200]
["Glasgow Central",3500,1.5,240000,170000,69000,3000,450]
["Glasgow East",3000,8.3000000000000007,36000,24000,13000,3000,300]
["Glasgow North",1000,3.3,30000,19000,11000,900,125]
["Glasgow North East",2500,6.6,38000,27000,11000,2250,200]
["Glasgow North West",3000,11.5,26000,17000,8000,3000,175]
["Glasgow South",800,5,16000,10000,6000,800,75]
["Glasgow South West",3500,7.6,46000,31000,15000,3500,200]
["Glenrothes",6000,19.399999999999999,31000,22000,9000,5000,500]
["Gloucester",4000,6.2,64000,41000,23000,3500,450]
["Gordon",7000,12.1,58000,44000,14000,7000,800]
["Gosport",2500,10.9,23000,15000,9000,2250,225]
["Gower",1250,6.9,18000,10000,8000,1250,100]
["Grantham and Stamford",5000,10.4,48000,31000,17000,4500,300]
["Gravesham",1750,5.3,33000,21000,13000,1500,150]
["Great Grimsby",7000,17.100000000000001,41000,27000,14000,6000,800]
["Great Yarmouth",3000,8.1,37000,22000,15000,2500,400]
["Greenwich and Woolwich",2250,3.9,57000,36000,21000,2000,225]
["Guildford",3500,4.7,74000,51000,23000,3500,225]
["Hackney North and Stoke Newington",900,2.5,36000,23000,13000,700,200]
["Hackney South and Shoreditch",2250,1.7,131000,103000,28000,1750,400]
["Halesowen and Rowley Regis",4500,16.7,27000,19000,8000,4000,500]
["Halifax",4000,8.6999999999999993,46000,31000,15000,4000,400]
["Haltemprice and Howden",7000,18.899999999999999,37000,25000,12000,7000,350]
["Halton",4000,10.5,38000,26000,13000,3500,350]
["Hammersmith",1500,1.3,116000,87000,29000,1500,125]
["Hampstead and Kilburn",600,1.1000000000000001,53000,37000,16000,450,125]
["Harborough",4000,10.5,38000,24000,14000,3500,450]
["Harlow",3500,7.6,46000,32000,14000,3000,400]
["Harrogate and Knaresborough",3000,5.7,53000,34000,20000,2500,350]
["Harrow East",1250,4.3,29000,20000,10000,1250,200]
["Harrow West",450,1.2,39000,26000,13000,400,75]
["Hartlepool",3500,11.7,30000,20000,10000,3500,250]
["Harwich and North Essex",2000,4.9000000000000004,41000,29000,12000,1500,350]
["Hastings and Rye",3000,8.1,37000,23000,14000,2500,350]
["Havant",2500,8.1,31000,20000,11000,2250,250]
["Hayes and Harlington",3000,3.2,94000,72000,23000,2500,250]
["Hazel Grove",2250,10.7,21000,14000,7000,2250,175]
["Hemel Hempstead",2500,2.5,99000,84000,15000,2500,350]
["Hemsworth",3000,10.7,28000,18000,10000,2500,225]
["Hendon",2000,3.7,54000,36000,17000,1750,225]
["Henley",3000,6.2,48000,33000,15000,2250,450]
["Hereford and South Herefordshire",7000,14.6,48000,30000,17000,6000,700]
["Hertford and Stortford",3500,6.4,55000,36000,19000,3000,300]
["Hertsmere",2500,4.3,58000,41000,17000,2500,200]
["Hexham",2500,9.6,26000,16000,10000,2250,200]
["Heywood and Middleton",4500,12.5,36000,26000,10000,4000,500]
["High Peak",6000,18.2,33000,21000,12000,5000,450]
["Hitchin and Harpenden",1750,4.7,37000,24000,13000,1500,225]
["Holborn and St Pancras",3500,1,360000,282000,79000,3000,500]
["Hornchurch and Upminster",800,2.7,30000,19000,11000,700,125]
["Hornsey and Wood Green",900,2.5,36000,24000,13000,800,100]
["Horsham",2250,4.8,47000,31000,16000,2000,300]
["Houghton and Sunderland South",1500,7.1,21000,15000,6000,1250,100]
["Hove",1000,2.6,39000,25000,14000,800,175]
["Huddersfield",6000,12,50000,31000,20000,5000,500]
["Huntingdon",9000,15.3,59000,41000,18000,8000,800]
["Hyndburn",8000,23.5,34000,25000,9000,7000,450]
["Ilford North",800,3,27000,18000,9000,700,125]
["Ilford South",600,1.4,43000,29000,14000,500,75]
["Inverclyde",1750,7,25000,16000,9000,1500,175]
["Inverness, Nairn, Badenoch and Strathspey",2250,3.8,60000,39000,21000,2000,300]
["Ipswich",1500,2.4,62000,41000,21000,1250,200]
["Isle of Wight",4000,8,50000,31000,19000,3500,350]
["Islington North",450,1.3,34000,22000,12000,400,75]
["Islington South and Finsbury",2500,1.1000000000000001,226000,174000,52000,2250,250]
["Islwyn",6000,28.6,21000,14000,6000,6000,250]
["Jarrow",4000,14.8,27000,20000,7000,3500,300]
["Keighley",5000,13.5,37000,23000,14000,4500,600]
["Kenilworth and Southam",14000,28,50000,38000,13000,13000,800]
["Kensington",1000,1,99000,74000,25000,800,200]
["Kettering",4000,8.6999999999999993,46000,30000,16000,4000,300]
["Kilmarnock and Loudoun",2250,6.4,35000,22000,12000,2000,350]
["Kingston and Surbiton",2000,3.4,59000,37000,22000,1750,300]
["Kingston upon Hull East",15000,35.700000000000003,42000,32000,10000,14000,1500]
["Kingston upon Hull North",1750,7.6,23000,14000,9000,1500,225]
["Kingston upon Hull West and Hessle",6000,8.5,71000,48000,23000,5000,800]
["Kingswood",1500,5.8,26000,15000,11000,1250,150]
["Kirkcaldy and Cowdenbeath",2500,7.8,32000,21000,11000,2250,225]
["Knowsley",5000,10.9,46000,31000,15000,4500,500]
["Lanark and Hamilton East",4000,9.1,44000,28000,16000,3500,600]
["Lancaster and Fleetwood",2500,6.2,40000,26000,14000,2250,450]
["Leeds Central",11000,4.7,236000,173000,64000,10000,900]
["Leeds East",3500,8.3000000000000007,42000,30000,12000,3000,250]
["Leeds North East",300,1.4,22000,13000,9000,250,75]
["Leeds North West",1500,5.4,28000,18000,10000,1250,125]
["Leeds West",4000,6.9,58000,33000,25000,3500,500]
["Leicester East",10000,24.4,41000,29000,13000,9000,1000]
["Leicester South",3500,3.9,90000,58000,32000,3000,450]
["Leicester West",7000,15.9,44000,32000,12000,7000,700]
["Leigh",3500,10,35000,23000,11000,3000,600]
["Lewes",2500,7.1,35000,23000,12000,2000,500]
["Lewisham East",175,0.7,26000,17000,9000,150,30]
["Lewisham West and Penge",600,2.6,23000,14000,9000,500,75]
["Lewisham, Deptford",900,2.7,33000,20000,13000,800,100]
["Leyton and Wanstead",600,2.1,29000,19000,10000,500,125]
["Lichfield",6000,12.8,47000,32000,15000,5000,500]
["Lincoln",4500,7.5,60000,38000,23000,4000,300]
["Linlithgow and East Falkirk",6000,15.4,39000,28000,11000,5000,700]
["Liverpool, Riverside",3000,2,150000,100000,50000,2500,400]
["Liverpool, Walton",2000,5,40000,25000,15000,1750,350]
["Liverpool, Wavertree",1500,5.6,27000,17000,9000,1250,350]
["Liverpool, West Derby",100,0.5,19000,12000,8000,75,20]
["Livingston",6000,10.9,55000,39000,15000,5000,350]
["Llanelli",4000,14.3,28000,17000,10000,4000,400]
["Loughborough",6000,13,46000,30000,17000,5000,400]
["Louth and Horncastle",4000,13.3,30000,19000,11000,3500,300]
["Ludlow",4500,16.7,27000,18000,9000,4000,700]
["Luton North",1500,6,25000,17000,8000,1250,150]
["Luton South",4500,5.3,85000,57000,28000,4500,350]
["Macclesfield",7000,16.3,43000,29000,14000,6000,500]
["Maidenhead",1750,3.2,55000,40000,15000,1500,225]
["Maidstone and The Weald",2250,4.4000000000000004,51000,34000,17000,2000,250]
["Makerfield",2500,11.4,22000,15000,7000,2250,300]
["Maldon",3000,10,30000,20000,10000,2500,450]
["Manchester Central",6000,2.2000000000000002,275000,198000,76000,5000,900]
["Manchester, Gorton",1000,4.5,22000,14000,8000,1000,125]
["Manchester, Withington",800,2.6,31000,20000,11000,700,75]
["Mansfield",4000,9.1,44000,28000,15000,4000,350]
["Meon Valley",3500,6,58000,41000,17000,3000,350]
["Meriden",4500,4.8,93000,62000,32000,4000,200]
["Merthyr Tydfil and Rhymney",3000,12.5,24000,16000,8000,3000,200]
["Mid Bedfordshire",3000,7,43000,29000,13000,2500,300]
["Mid Derbyshire",900,4.0999999999999996,22000,14000,8000,800,75]
["Mid Dorset and North Poole",4000,13.3,30000,19000,10000,4000,300]
["Mid Norfolk",4000,11.1,36000,24000,12000,3500,500]
["Mid Sussex",2500,5.3,47000,31000,16000,2250,450]
["Mid Worcestershire",7000,15.6,45000,31000,14000,7000,900]
["Middlesbrough",2500,4.4000000000000004,57000,37000,20000,2250,350]
["Middlesbrough South and East Cleveland",1000,5.9,17000,10000,7000,900,125]
["Midlothian",2500,7.6,33000,22000,11000,2250,250]
["Milton Keynes North",4500,4.9000000000000004,91000,67000,24000,4000,450]
["Milton Keynes South",6000,6.7,89000,62000,26000,5000,500]
["Mitcham and Morden",1250,5.7,22000,14000,8000,1250,175]
["Mole Valley",1750,3.5,50000,35000,16000,1500,300]
["Monmouth",3000,8.3000000000000007,36000,23000,13000,3000,350]
["Montgomeryshire",4500,20.5,22000,14000,8000,4000,500]
["Moray",6000,16.7,36000,23000,13000,5000,800]
["Morecambe and Lunesdale",1500,5.6,27000,18000,9000,1500,175]
["Morley and Outwood",3500,7,50000,36000,14000,3000,300]
["Motherwell and Wishaw",1250,4.5,28000,18000,10000,1250,100]
["Na h-Eileanan An Iar",900,8.1999999999999993,11000,7000,4500,800,125]
["Neath",1500,9.4,16000,10000,6000,1500,75]
["New Forest East",3500,9.6999999999999993,36000,25000,12000,3500,300]
["New Forest West",2500,7.1,35000,22000,13000,2250,300]
["Newark",6000,12.8,47000,32000,15000,5000,1000]
["Newbury",9000,12.9,70000,52000,19000,9000,700]
["Newcastle upon Tyne Central",1000,1,102000,68000,34000,1000,125]
["Newcastle upon Tyne East",3000,5.2,58000,41000,17000,3000,175]
["Newcastle upon Tyne North",2250,7.5,30000,20000,10000,2250,150]
["Newcastle-under-Lyme",3500,9,39000,27000,12000,3500,350]
["Newport East",5000,17.899999999999999,28000,20000,9000,4500,300]
["Newport West",3500,6.7,52000,36000,16000,3500,300]
["Newton Abbot",2500,8.1,31000,19000,12000,2250,300]
["Normanton, Pontefract and Castleford",11000,20,55000,41000,14000,10000,800]
["North Ayrshire and Arran",2500,10.9,23000,15000,8000,2250,225]
["North Cornwall",3500,9.5,37000,23000,15000,3000,400]
["North Devon",6000,14.3,42000,26000,16000,5000,450]
["North Dorset",4000,12.1,33000,21000,11000,4000,400]
["North Durham",1750,7,25000,18000,7000,1750,150]
["North East Bedfordshire",3000,8.3000000000000007,36000,25000,11000,2500,250]
["North East Cambridgeshire",7000,17.100000000000001,41000,29000,12000,6000,500]
["North East Derbyshire",4000,14.8,27000,18000,9000,3500,300]
["North East Fife",1250,4.5999999999999996,27000,17000,10000,1250,150]
["North East Hampshire",1750,4.9000000000000004,36000,25000,11000,1750,225]
["North East Hertfordshire",6000,15,40000,27000,13000,5000,600]
["North East Somerset",2500,7.8,32000,21000,12000,2250,400]
["North Herefordshire",4500,15.5,29000,19000,10000,4000,600]
["North Norfolk",1750,6.7,26000,15000,11000,1500,225]
["North Shropshire",6000,15,40000,27000,13000,5000,800]
["North Somerset",4500,9.4,48000,33000,15000,4000,350]
["North Swindon",4000,7.8,51000,36000,14000,3500,350]
["North Thanet",1500,4.3,29000,19000,10000,1250,175]
["North Tyneside",4500,10.199999999999999,44000,32000,13000,4000,500]
["North Warwickshire",9000,14.3,63000,45000,18000,8000,1250]
["North West Cambridgeshire",4500,7.4,61000,44000,18000,4000,400]
["North West Durham",4000,17.399999999999999,23000,15000,8000,3500,600]
["North West Hampshire",5000,11.6,43000,30000,13000,4500,700]
["North West Leicestershire",7000,9.9,71000,55000,16000,7000,500]
["North West Norfolk",5000,11.1,45000,29000,16000,5000,350]
["North Wiltshire",2500,7.1,35000,24000,11000,2500,250]
["Northampton North",4000,12.5,32000,22000,10000,3000,1250]
["Northampton South",3500,4.9000000000000004,72000,46000,25000,3500,300]
["Norwich North",3500,8.5,41000,29000,13000,3500,350]
["Norwich South",2250,3.3,68000,43000,25000,2000,225]
["Nottingham East",1500,2.4,63000,40000,23000,1250,225]
["Nottingham North",2250,8,28000,18000,9000,2000,250]
["Nottingham South",6000,5.2,116000,81000,35000,6000,500]
["Nuneaton",2500,7.8,32000,21000,11000,2250,350]
["Ochil and South Perthshire",3000,9.6999999999999993,31000,21000,10000,3000,250]
["Ogmore",4500,20.5,22000,15000,7000,4500,250]
["Old Bexley and Sidcup",1000,4,25000,16000,10000,900,75]
["Oldham East and Saddleworth",5000,15.2,33000,22000,11000,4500,500]
["Oldham West and Royton",5000,10,50000,36000,14000,5000,350]
["Orkney and Shetland",1250,5.2,24000,14000,10000,1000,350]
["Orpington",1250,3.8,33000,22000,11000,1000,100]
["Oxford East",3500,3.4,103000,69000,33000,3500,175]
["Oxford West and Abingdon",3000,5.3,57000,40000,17000,2500,250]
["Paisley and Renfrewshire North",7000,12.7,55000,37000,17000,7000,450]
["Paisley and Renfrewshire South",900,3.1,29000,19000,10000,700,125]
["Pendle",8000,25.8,31000,22000,8000,8000,600]
["Penistone and Stocksbridge",4500,15,30000,21000,9000,4000,300]
["Penrith and The Border",4000,10,40000,28000,13000,3500,500]
["Perth and North Perthshire",3000,6.7,45000,31000,14000,2500,300]
["Peterborough",7000,9.6999999999999993,72000,50000,23000,6000,450]
["Plymouth, Moor View",4500,11.2,40000,27000,13000,4000,300]
["Plymouth, Sutton and Devonport",9000,15,60000,39000,21000,9000,350]
["Pontypridd",6000,13.3,45000,30000,16000,5000,450]
["Poole",6000,11.3,53000,35000,18000,6000,450]
["Poplar and Limehouse",1250,0.6,195000,159000,36000,1000,175]
["Portsmouth North",6000,9.6999999999999993,62000,44000,18000,5000,450]
["Portsmouth South",2500,5.7,44000,26000,18000,2500,125]
["Preseli Pembrokeshire",1250,4.8,26000,16000,11000,1000,125]
["Preston",3500,5.3,66000,46000,20000,3000,600]
["Pudsey",4500,13.2,34000,23000,11000,4000,400]
["Putney",400,1.3,30000,20000,10000,350,50]
["Rayleigh and Wickford",1750,7.3,24000,16000,9000,1750,250]
["Reading East",1750,1.8,95000,70000,24000,1500,350]
["Reading West",1750,2.7,64000,50000,14000,1500,150]
["Redcar",3500,13,27000,19000,9000,3000,300]
["Redditch",8000,20,40000,29000,11000,7000,600]
["Reigate",2000,3.4,58000,41000,17000,1750,200]
["Rhondda",1500,10.7,14000,9000,5000,1250,125]
["Ribble Valley",12000,21.4,56000,41000,15000,11000,800]
["Richmond (Yorks)",4000,9.3000000000000007,43000,28000,15000,3500,600]
["Richmond Park",600,1.1000000000000001,55000,37000,18000,450,100]
["Rochdale",5000,11.6,43000,30000,13000,5000,500]
["Rochester and Strood",4500,8,56000,39000,17000,4000,350]
["Rochford and Southend East",4000,8.9,45000,29000,16000,3500,350]
["Romford",600,1.4,42000,26000,15000,500,100]
["Romsey and Southampton North",2500,7.4,34000,24000,10000,2250,350]
["Ross, Skye and Lochaber",1750,6.2,28000,18000,10000,1500,200]
["Rossendale and Darwen",6000,22.2,27000,19000,8000,5000,450]
["Rother Valley",4000,16,25000,17000,8000,3500,450]
["Rotherham",7000,15.6,45000,30000,15000,6000,900]
["Rugby",6000,12.2,49000,35000,14000,6000,450]
["Ruislip, Northwood and Pinner",350,1,36000,24000,12000,300,50]
["Runnymede and Weybridge",1500,1.8,82000,56000,26000,1500,175]
["Rushcliffe",2250,5.5,41000,26000,15000,2000,250]
["Rutherglen and Hamilton West",2500,8.9,28000,20000,9000,2000,300]
["Rutland and Melton",7000,17.5,40000,26000,14000,6000,900]
["Saffron Walden",3000,5.0999999999999996,59000,40000,20000,2500,450]
["Salford and Eccles",4000,3.3,120000,93000,27000,3500,450]
["Salisbury",3000,5.8,52000,34000,18000,3000,300]
["Scarborough and Whitby",5000,12.2,41000,24000,17000,4000,500]
["Scunthorpe",11000,25.6,43000,30000,12000,10000,500]
["Sedgefield",7000,21.2,33000,24000,9000,7000,600]
["Sefton Central",700,3.3,21000,13000,8000,600,100]
["Selby and Ainsty",8000,19,42000,31000,12000,8000,500]
["Sevenoaks",2000,4.9000000000000004,41000,27000,15000,1750,200]
["Sheffield Central",5000,4.3,116000,75000,41000,4500,450]
["Sheffield South East",8000,12.7,63000,44000,20000,7000,600]
["Sheffield, Brightside and Hillsborough",4000,11.1,36000,23000,12000,4000,450]
["Sheffield, Hallam",300,1.7,18000,11000,7000,250,35]
["Sheffield, Heeley",450,2.5,18000,9000,9000,400,75]
["Sherwood",2250,6.6,34000,21000,13000,1750,250]
["Shipley",3500,12.1,29000,19000,10000,3500,300]
["Shrewsbury and Atcham",3000,5.6,54000,34000,20000,3000,450]
["Sittingbourne and Sheppey",5000,11.9,42000,30000,12000,4500,450]
["Skipton and Ripon",5000,10.4,48000,31000,17000,5000,500]
["Sleaford and North Hykeham",6000,13.6,44000,32000,12000,6000,300]
["Slough",5000,6.9,72000,53000,19000,4500,500]
["Solihull",10000,18.5,55000,39000,16000,10000,300]
["Somerton and Frome",6000,15.8,38000,25000,13000,5000,500]
["South Basildon and East Thurrock",1500,4.4000000000000004,34000,23000,10000,1250,125]
["South Cambridgeshire",6000,8.3000000000000007,72000,54000,18000,5000,500]
["South Derbyshire",6000,17.600000000000001,34000,23000,11000,6000,300]
["South Dorset",1750,5.8,30000,18000,12000,1750,125]
["South East Cambridgeshire",8000,13.1,61000,44000,16000,7000,600]
["South East Cornwall",2500,9.3000000000000007,27000,17000,10000,2250,300]
["South Holland and The Deepings",7000,17.100000000000001,41000,29000,12000,7000,400]
["South Leicestershire",5000,7,71000,53000,18000,4000,500]
["South Norfolk",4500,9.4,48000,30000,18000,4000,400]
["South Northamptonshire",3000,4.3,69000,51000,18000,3000,300]
["South Ribble",4000,12.5,32000,22000,10000,3500,500]
["South Shields",1000,5,20000,13000,7000,800,225]
["South Staffordshire",5000,16.100000000000001,31000,21000,10000,4500,600]
["South Suffolk",4500,13.6,33000,21000,12000,3500,600]
["South Swindon",2500,4,62000,43000,19000,2500,150]
["South Thanet",2000,6.5,31000,20000,11000,1750,300]
["South West Bedfordshire",6000,12.8,47000,33000,14000,5000,500]
["South West Devon",6000,18.8,32000,22000,10000,5000,350]
["South West Hertfordshire",1500,3.2,47000,33000,14000,1250,225]
["South West Norfolk",7000,20.6,34000,23000,10000,6000,600]
["South West Surrey",1250,2.7,46000,27000,19000,1000,175]
["South West Wiltshire",4500,10.7,42000,27000,15000,4500,400]
["Southampton, Itchen",1750,3.5,50000,32000,18000,1500,225]
["Southampton, Test",2250,3.9,58000,39000,19000,2000,250]
["Southend West",700,2.5,28000,17000,10000,600,125]
["Southport",1000,3.2,31000,19000,12000,1000,125]
["Spelthorne",1500,3.8,40000,28000,12000,1250,225]
["St Albans",1500,2.9,51000,34000,17000,1250,300]
["St Austell and Newquay",2500,6.2,40000,24000,15000,2250,225]
["St Helens North",2500,7.8,32000,23000,9000,2250,225]
["St Helens South and Whiston",4000,7.3,55000,32000,23000,3500,350]
["St Ives",1250,4.2,30000,17000,13000,1250,175]
["Stafford",4500,9.4,48000,33000,15000,4000,300]
["Staffordshire Moorlands",2500,10.9,23000,14000,9000,2500,300]
["Stalybridge and Hyde",3000,13.6,22000,14000,8000,2500,500]
["Stevenage",6000,11.1,54000,38000,16000,5000,350]
["Stirling",2500,5.3,47000,31000,15000,2250,225]
["Stockport",3500,6.4,55000,40000,15000,3000,350]
["Stockton North",7000,15.6,45000,32000,13000,6000,700]
["Stockton South",3500,9.6999999999999993,36000,25000,12000,3000,500]
["Stoke-on-Trent Central",6000,8.6999999999999993,69000,47000,22000,5000,700]
["Stoke-on-Trent North",6000,22.2,27000,19000,8000,5000,600]
["Stoke-on-Trent South",6000,18.8,32000,21000,11000,5000,700]
["Stone",4000,14.8,27000,18000,9000,3500,600]
["Stourbridge",3500,15.9,22000,14000,8000,3000,400]
["Stratford-on-Avon",3000,5.9,51000,34000,18000,2500,500]
["Streatham",250,1,24000,15000,8000,175,50]
["Stretford and Urmston",7000,8.1999999999999993,85000,58000,26000,6000,700]
["Stroud",9000,20.9,43000,28000,15000,8000,1000]
["Suffolk Coastal",3500,7,50000,35000,15000,3000,500]
["Sunderland Central",2000,4.2,48000,31000,17000,1750,300]
["Surrey Heath",3500,7,50000,34000,16000,3000,450]
["Sutton and Cheam",450,0.8,53000,37000,16000,400,50]
["Sutton Coldfield",1750,4.9000000000000004,36000,23000,13000,1500,225]
["Swansea East",3000,6.1,49000,30000,18000,2500,125]
["Swansea West",1000,2.4,41000,25000,16000,1000,125]
["Tamworth",5000,13.2,38000,26000,12000,4000,600]
["Tatton",4000,6.9,58000,42000,16000,4000,400]
["Taunton Deane",3000,5.4,56000,35000,21000,2500,400]
["Telford",11000,18.600000000000001,59000,43000,16000,10000,900]
["Tewkesbury",11000,19,58000,42000,16000,10000,900]
["The Cotswolds",6000,11.8,51000,33000,18000,5000,500]
["The Wrekin",4500,11.2,40000,28000,13000,4500,250]
["Thirsk and Malton",8000,19.5,41000,27000,14000,8000,600]
["Thornbury and Yate",3500,9,39000,27000,12000,3000,300]
["Thurrock",2500,4,62000,41000,20000,2500,150]
["Tiverton and Honiton",5000,14.3,35000,22000,13000,4000,900]
["Tonbridge and Malling",2250,5,45000,32000,14000,1750,300]
["Tooting",500,1.1000000000000001,46000,29000,17000,400,100]
["Torbay",700,1.8,38000,21000,17000,600,75]
["Torfaen",6000,19.399999999999999,31000,21000,10000,5000,400]
["Torridge and West Devon",2500,8.9,28000,17000,11000,2250,300]
["Totnes",2500,7.8,32000,20000,12000,2250,450]
["Tottenham",2250,6.1,37000,25000,13000,2000,400]
["Truro and Falmouth",3500,6.2,56000,34000,22000,3500,350]
["Tunbridge Wells",2000,4.2,48000,32000,15000,1500,450]
["Twickenham",700,1.6,44000,30000,13000,600,50]
["Tynemouth",2000,4.7,43000,29000,14000,1750,225]
["Uxbridge and South Ruislip",4000,5.5,73000,52000,21000,3500,350]
["Vale of Clwyd",2250,6.8,33000,20000,13000,2000,150]
["Vale of Glamorgan",3500,11.3,31000,19000,11000,3000,150]
["Vauxhall",700,0.7,99000,72000,27000,700,75]
["Wakefield",5000,8.5,59000,40000,19000,4500,500]
["Wallasey",1750,9.1999999999999993,19000,12000,8000,1500,250]
["Walsall North",4500,15,30000,22000,9000,4000,700]
["Walsall South",5000,10.6,47000,30000,17000,4000,800]
["Walthamstow",1500,5,30000,20000,10000,1250,225]
["Wansbeck",2000,8,25000,16000,9000,1750,175]
["Wantage",4500,7.3,62000,46000,16000,4000,400]
["Warley",4000,14.3,28000,19000,9000,3500,500]
["Warrington North",4500,6.8,66000,51000,15000,4000,350]
["Warrington South",2000,2.8,72000,51000,21000,1750,175]
["Warwick and Leamington",4000,5.6,71000,48000,23000,3500,400]
["Washington and Sunderland West",15000,34.9,43000,33000,10000,15000,500]
["Watford",2000,2.6,76000,49000,27000,1750,350]
["Waveney",4500,13.2,34000,21000,12000,4000,400]
["Wealden",3000,8.6,35000,23000,12000,2500,350]
["Weaver Vale",5000,11.4,44000,31000,13000,4500,400]
["Wellingborough",6000,13,46000,32000,14000,6000,500]
["Wells",5000,11.6,43000,26000,17000,4500,600]
["Welwyn Hatfield",4000,5.0999999999999996,79000,59000,21000,3000,600]
["Wentworth and Dearne",4000,11.1,36000,24000,12000,3500,300]
["West Aberdeenshire and Kincardine",4000,9.8000000000000007,41000,29000,12000,3500,400]
["West Bromwich East",6000,15.4,39000,25000,13000,5000,1000]
["West Bromwich West",10000,20.399999999999999,49000,37000,13000,9000,1000]
["West Dorset",5000,9.8000000000000007,51000,32000,19000,4000,600]
["West Dunbartonshire",2250,7,32000,21000,11000,2250,200]
["West Ham",1750,2,88000,64000,25000,1750,125]
["West Lancashire",6000,13.6,44000,30000,14000,5000,700]
["West Suffolk",6000,14,43000,28000,15000,5000,1000]
["West Worcestershire",5000,13.9,36000,23000,13000,4500,700]
["Westminster North",400,1,42000,29000,13000,350,75]
["Westmorland and Lonsdale",3500,8.3000000000000007,42000,27000,15000,3000,500]
["Weston-Super-Mare",2500,6,42000,25000,17000,2500,225]
["Wigan",6000,12.5,48000,32000,16000,5000,450]
["Wimbledon",1000,1.9,54000,37000,17000,1000,175]
["Winchester",3000,4.8,62000,40000,21000,2500,400]
["Windsor",2250,3,75000,55000,21000,2000,250]
["Wirral South",3500,12.1,29000,19000,10000,3500,150]
["Wirral West",300,1.7,18000,11000,8000,250,40]
["Witham",3500,9.6999999999999993,36000,25000,11000,3000,400]
["Witney",6000,12.8,47000,32000,14000,5000,500]
["Woking",4000,8.3000000000000007,48000,33000,15000,4000,250]
["Wokingham",3500,5.6,63000,43000,20000,3000,225]
["Wolverhampton North East",5000,11.1,45000,31000,14000,5000,300]
["Wolverhampton South East",6000,19.399999999999999,31000,22000,8000,6000,600]
["Wolverhampton South West",1750,5,35000,22000,13000,1750,175]
["Worcester",5000,9.3000000000000007,54000,35000,19000,4500,600]
["Workington",3500,13.5,26000,17000,9000,3000,400]
["Worsley and Eccles South",2250,7.8,29000,20000,8000,2000,250]
["Worthing West",1250,2.9,43000,26000,17000,1000,200]
["Wrexham",9000,20,45000,30000,15000,9000,450]
["Wycombe",4000,7,57000,39000,18000,3500,450]
["Wyre and Preston North",2000,4.5,44000,31000,14000,1500,300]
["Wyre Forest",3500,10.3,34000,22000,12000,3500,350]
["Wythenshawe and Sale East",3000,4.0999999999999996,74000,54000,20000,2500,350]
["Yeovil",9000,18.399999999999999,49000,32000,17000,9000,600]
["Ynys Mon",2500,11.9,21000,13000,8000,2500,225]
["York Central",900,1.5,61000,38000,23000,700,175]
["York Outer",3000,6.1,49000,30000,19000,3000,250]

{"sheet":"redundant Data","index":5,"n_rows":671,"n_cols":20,"rows_kept":671,"cut":false,"hidden":true,"merged":[[6,10,6,12],[6,14,6,16]]}
["JB Manufacturing Constituency Tool"]
["Sources: ONS, Theyworkforyou, Parliament",null,"Use the filters below to extract data to requirements. E.g. You could find newly elected MPs in constituencies in the North East which are manufacturing dependent who held conservative in the 2019 GE"]
[]
[]
[null,null,null,null,"Yellow: Above average"]
[null,null,"Data missing (NI)",null,"Orange: Above 2x the average"]
[null,null,null,null,"Red: Above 3x the average",null,null,null,null,null,"Post December 2019 MPs",null,null,null,"Pre december 2019 MPs",null,null,"Full-time Mfg employees","Part-time Mfg employees"]
["Region","parliamentary constituency 2010","Mfg Employee count 2018","Total Constit Employee count 2018","MFG job percent of total (Yellow higher than average :manufacturing dependent)","2019 Mfg Business count","2014 Mfg Business Count","2018 Mfg Business count","1-Year Change Business Count","5-Year Change Business Count","First name","Last name","Party","Hold or Change","First name","Last name","Party","number","number","New or Same MP?"]
["Wales","Aberavon",8000,31000,{"$f":"(C9/D9)*100","v":25.806451612903224},110,105,105,{"$f":"F9-H9","v":5},{"$f":"F9-G9","v":5},"Stephen","Kinnock","Labour",{"$f":"IF(M9=Q9, \"Hold\", \"Change\")","v":"Hold"},"Stephen","Kinnock","Labour",8000,225,{"$f":"IF(L9=P9, \"Same MP\", \"New MP\")","v":"Same MP"}]
["Wales","Aberconwy",600,27000,{"$f":"(C10/D10)*100","v":2.2222222222222223},105,95,100,5,10,"Robin John","Millar","Conservative",{"$f":"IF(M10=Q10, \"Hold\", \"Change\")","v":"Change"},"Guto","Bebb","Independent",500,45,{"$f":"IF(L10=P10, \"Same MP\", \"New MP\")","v":"New MP"}]
["Scotland","Aberdeen North",1000,75000,{"$f":"(C11/D11)*100","v":1.3333333333333335},100,105,100,0,-5,"Kirsty","Blackman","Scottish National Party","Hold","Kirsty","Blackman","Scottish National Party",1000,125,"Same MP"]
["Scotland","Aberdeen South",3000,61000,4.918032786885246,195,175,205,-10,20,"Stephen","Flynn","Scottish National Party","Change","Ross","Thomson","Conservative",3000,350,"New MP"]
["Scotland","Airdrie and Shotts",2000,30000,6.666666666666667,145,120,145,0,25,"Neil","Gray","Scottish National Party","Hold","Neil","Gray","Scottish National Party",1750,150,"Same MP"]
["South East","Aldershot",3500,55000,6.3636363636363633,215,200,215,0,15,"Leo","Docherty","Conservative","Hold","Leo","Docherty","Conservative",3000,300,"Same MP"]
["West Midlands","Aldridge-Brownhills",5000,25000,20,250,225,240,10,25,"Wendy","Morton","Conservative","Hold","Wendy","Morton","Conservative",4500,400,"Same MP"]
["North West","Altrincham and Sale West",2000,52000,3.8461538461538463,175,165,185,-10,10,"Graham","Brady","Conservative","Hold","Graham","Brady","Conservative",2000,125,"Same MP"]
["Wales","Alyn and Deeside",17000,49000,34.693877551020407,245,215,240,5,30,"Mark","Tami","Labour","Hold","Mark","Tami","Labour",17000,350,"Same MP"]
["East Midlands","Amber Valley",9000,38000,23.684210526315788,290,290,290,0,0,"Nigel","Mills","Conservative","Hold","Nigel","Mills","Conservative",9000,700,"Same MP"]
["Scotland","Angus",4500,28000,16.071428571428573,195,165,190,5,30,"Dave","Doogan","Scottish National Party","Change","Kirstene","Hair","Conservative",4000,250,"New MP"]
["Wales","Arfon",1500,32000,4.6875,105,90,100,5,15,"Hywel","Williams","Plaid Cymru","Hold","Hywel","Williams","Plaid Cymru",1250,125,"Same MP"]
["Scotland","Argyll and Bute",2000,35000,5.7142857142857144,185,165,185,0,20,"Brendan","O'Hara","Scottish National Party","Hold","Brendan","O'Hara","Scottish National Party",1750,300,"Same MP"]
["South East","Arundel and South Downs",2500,34000,7.3529411764705888,320,325,320,0,-5,"Andrew","Griffith","Conservative","Hold","Nick","Herbert","Conservative",2250,200,"New MP"]
["East Midlands","Ashfield",9000,50000,18,275,260,280,-5,15,"Lee","Anderson","Conservative","Change","Gloria","De Piero","Labour",8000,600,"New MP"]
["South East","Ashford",5000,53000,9.433962264150944,305,315,310,-5,-10,"Damian","Green","Conservative","Hold","Damian","Green","Conservative",4500,400,"Same MP"]
["North West","Ashton-under-Lyne",4000,35000,11.428571428571429,220,205,220,0,15,"Angela","Rayner","Labour","Hold","Angela","Rayner","Labour",4000,400,"Same MP"]
["South East","Aylesbury",3000,52000,5.7692307692307692,215,200,210,5,15,"Rob","Butler","Conservative","Hold","David","Lidington","Conservative",2500,300,"New MP"]
["Scotland","Ayr, Carrick and Cumnock",1500,33000,4.5454545454545459,160,100,150,10,60,"Allan","Dorans","Scottish National Party","Change","Bill","Grant","Conservative",1250,225,"New MP"]
["South East","Banbury",7000,63000,11.111111111111111,285,280,290,-5,5,"Victoria","Prentis","Conservative","Hold","Victoria","Prentis","Conservative",6000,500,"Same MP"]
["Scotland","Banff and Buchan",6000,34000,17.647058823529413,320,285,310,10,35,"David","Duguid","Conservative","Hold","David","Duguid","Conservative",6000,600,"Same MP"]
["London","Barking",1500,36000,4.1666666666666661,160,140,160,0,20,"Margaret","Hodge","Labour","Hold","Margaret","Hodge","Labour",1250,200,"Same MP"]
["Yorkshire & the Humber","Barnsley Central",4000,40000,10,185,155,185,0,30,"Dan","Jarvis","Labour","Hold","Dan","Jarvis","Labour",3500,300,"Same MP"]
["Yorkshire & the Humber","Barnsley East",6000,25000,24,140,120,135,5,20,"Stephanie","Peacock","Labour","Hold","Stephanie","Peacock","Labour",6000,600,"Same MP"]
["North West","Barrow and Furness",10000,38000,26.315789473684209,195,180,205,-10,15,"Simon","Fell","Conservative","Change","John","Woodcock","Independent",10000,400,"New MP"]
["Eastern","Basildon and Billericay",4500,55000,8.1818181818181817,255,240,255,0,15,"John","Baron","Conservative","Hold","John","Baron","Conservative",4000,400,"Same MP"]
["South East","Basingstoke",4000,69000,5.7971014492753623,190,185,190,0,5,"Maria","Miller","Conservative","Hold","Maria","Miller","Conservative",3500,300,"Same MP"]
["East Midlands","Bassetlaw",8000,43000,18.604651162790699,270,245,265,5,25,"Brendan","Clarke-Smith","Conservative","Change","John","Mann","Labour",8000,800,"New MP"]
["South West","Bath",1500,57000,2.6315789473684208,125,125,120,5,0,"Wera","Hobhouse","Liberal Democrat","Hold","Wera","Hobhouse","Liberal Democrat",1500,150,"Same MP"]
["Yorkshire & the Humber","Batley and Spen",8000,42000,19.047619047619047,385,360,380,5,25,"Tracy","Brabin","Labour/Co-operative","Hold","Tracy","Brabin","Labour/Co-operative",7000,700,"Same MP"]
["London","Battersea",1000,47000,2.1276595744680851,195,175,205,-10,20,"Marsha","de Cordova","Labour","Hold","Marsha","de Cordova","Labour",800,150,"Same MP"]
["South East","Beaconsfield",3000,57000,5.2631578947368416,245,240,250,-5,5,"Joy","Morrissey","Conservative","Change","Dominic","Grieve","Independent",2500,300,"New MP"]
["London","Beckenham",350,23000,1.5217391304347827,110,120,115,-5,-10,"Bob","Stewart","Conservative","Hold","Bob","Stewart","Conservative",300,45,"Same MP"]
["Eastern","Bedford",4500,56000,8.0357142857142865,215,190,210,5,25,"Mohammad","Yasin","Labour","Hold","Mohammad","Yasin","Labour",3500,700,"Same MP"]
["Northern Ireland","Belfast East",null,null,{"$error":"#DIV/0!"},175,110,175,0,65,"Gavin","Robinson","DUP","Hold","Gavin","Robinson","DUP",null,null,"Same MP"]
["Northern Ireland","Belfast North",null,null,{"$error":"#DIV/0!"},130,95,135,-5,35,"John","Finucane","Sinn Fein","Change","Nigel","Dodds","DUP",null,null,"New MP"]
["Northern Ireland","Belfast South",null,null,{"$error":"#DIV/0!"},145,90,130,15,55,"Claire","Hanna","Social Democratic and Labour Party","Change","Emma","Little Pengelly","DUP",null,null,"New MP"]
["Northern Ireland","Belfast West",null,null,{"$error":"#DIV/0!"},105,85,100,5,20,"Paul","Maskey","Sinn Fein","Hold","Paul","Maskey","Sinn Fein",null,null,"Same MP"]
["London","Bermondsey and Old Southwark",1750,199000,0.87939698492462315,280,220,255,25,60,"Neil","Coyle","Labour","Hold","Neil","Coyle","Labour",1500,225,"Same MP"]
["Scotland","Berwickshire, Roxburgh and Selkirk",4500,36000,12.5,235,215,215,20,20,"John","Lamont","Conservative","Hold","John","Lamont","Conservative",4000,500,"Same MP"]
["North East","Berwick-upon-Tweed",1500,23000,6.5217391304347823,150,135,155,-5,15,"Anne-Marie","Trevelyan","Conservative","Hold","Anne-Marie","Trevelyan","Conservative",1250,300,"Same MP"]
["London","Bethnal Green and Bow",1250,103000,1.2135922330097086,280,285,345,-65,-5,"Rushanara","Ali","Labour","Hold","Rushanara","Ali","Labour",1000,250,"Same MP"]
["Yorkshire & the Humber","Beverley and Holderness",4500,34000,13.23529411764706,230,205,240,-10,25,"Graham","Stuart","Conservative","Hold","Graham","Stuart","Conservative",4000,250,"Same MP"]
["South East","Bexhill and Battle",1500,30000,5,235,215,225,10,20,"Huw","Merriman","Conservative","Hold","Huw","Merriman","Conservative",1500,200,"Same MP"]
["London","Bexleyheath and Crayford",1250,28000,4.4642857142857144,160,145,165,-5,15,"David","Evennett","Conservative","Hold","David","Evennett","Conservative",1250,125,"Same MP"]
["North West","Birkenhead",2500,35000,7.1428571428571423,160,135,160,0,25,"Mick","Whitley","Labour","Change","Frank","Field","Independent",2250,350,"New MP"]
["West Midlands","Birmingham, Edgbaston",2000,58000,3.4482758620689653,105,75,90,15,30,"Preet Kaur","Gill","Labour/Co-operative","Hold","Preet Kaur","Gill","Labour/Co-operative",1750,125,"Same MP"]
["West Midlands","Birmingham, Erdington",6000,35000,17.142857142857142,125,115,120,5,10,"Jack","Dromey","Labour","Hold","Jack","Dromey","Labour",6000,175,"Same MP"]
["West Midlands","Birmingham, Hall Green",1750,25000,7.0000000000000009,180,155,190,-10,25,"Tahir","Ali","Labour","Hold","Roger","Godsiff","Labour",1500,250,"New MP"]
["West Midlands","Birmingham, Hodge Hill",2000,27000,7.4074074074074066,110,85,105,5,25,"Liam","Byrne","Labour","Hold","Liam","Byrne","Labour",2000,150,"Same MP"]
["West Midlands","Birmingham, Ladywood",13000,222000,5.8558558558558556,835,860,980,-145,-25,"Shabana","Mahmood","Labour","Hold","Shabana","Mahmood","Labour",11000,1500,"Same MP"]
["West Midlands","Birmingham, Northfield",1500,23000,6.5217391304347823,90,80,85,5,10,"Gary","Sambrook","Conservative","Change","Richard","Burden","Labour",1250,150,"New MP"]
["West Midlands","Birmingham, Perry Barr",3500,27000,12.962962962962962,210,220,225,-15,-10,"Khalid","Mahmood","Labour","Hold","Khalid","Mahmood","Labour",3500,250,"Same MP"]
["West Midlands","Birmingham, Selly Oak",800,21000,3.8095238095238098,100,85,95,5,15,"Steve","McCabe","Labour","Hold","Steve","McCabe","Labour",700,100,"Same MP"]
["West Midlands","Birmingham, Yardley",5000,35000,14.285714285714285,245,240,245,0,5,"Jess","Phillips","Labour","Hold","Jess","Phillips","Labour",5000,400,"Same MP"]
["North East","Bishop Auckland",4500,30000,15,220,205,225,-5,15,"Dehenna","Davison","Conservative","Change","Helen","Goodman","Labour",4500,350,"New MP"]
["North West","Blackburn",8000,59000,13.559322033898304,320,290,320,0,30,"Kate","Hollern","Labour","Hold","Kate","Hollern","Labour",8000,700,"Same MP"]
["North West","Blackley and Broughton",1500,44000,3.4090909090909087,160,125,160,0,35,"Graham","Stringer","Labour","Hold","Graham","Stringer","Labour",1250,200,"Same MP"]
["North West","Blackpool North and Cleveleys",2250,31000,7.2580645161290329,125,125,130,-5,0,"Paul","Maynard","Conservative","Hold","Paul","Maynard","Conservative",2250,150,"Same MP"]
["North West","Blackpool South",2500,38000,6.5789473684210522,130,125,125,5,5,"Scott","Lloyd Benton","Conservative","Change","Gordon","Marsden","Labour",2500,125,"New MP"]
["Wales","Blaenau Gwent",4000,18000,22.222222222222221,110,110,115,-5,0,"Nick","Smith","Labour","Hold","Nick","Smith","Labour",3500,450,"Same MP"]
["North East","Blaydon",4500,35000,12.857142857142856,170,155,170,0,15,"Liz","Twist","Labour","Hold","Liz","Twist","Labour",4000,225,"Same MP"]
["North East","Blyth Valley",6000,28000,21.428571428571427,185,160,180,5,25,"Ian","Levy","Conservative","Change","Ronnie","Campbell","Labour",6000,450,"New MP"]
["South East","Bognor Regis and Littlehampton",2500,32000,7.8125,225,225,230,-5,0,"Nick","Gibb","Conservative","Hold","Nick","Gibb","Conservative",2250,225,"Same MP"]
["East Midlands","Bolsover",5000,34000,14.705882352941178,225,240,230,{"$f":"F73-H73","v":-5},{"$f":"F73-G73","v":-15},"Mark","Fletcher","Conservative","Change","Dennis","Skinner","Labour",5000,300,"New MP"]
["North West","Bolton North East",3500,36000,9.7222222222222232,270,235,255,15,35,"Mark","Logan","Conservative",{"$f":"IF(M74=Q74, \"Hold\", \"Change\")","v":"Change"},"David","Crausby","Labour",3000,350,{"$f":"IF(L74=P74, \"Same MP\", \"New MP\")","v":"New MP"}]
["North West","Bolton South East",4500,42000,{"$f":"(C75/D75)*100","v":10.714285714285714},235,205,250,-15,30,"Yasmin","Qureshi","Labour","Hold","Yasmin","Qureshi","Labour",4000,600,"Same MP"]
["North West","Bolton West",6000,37000,16.216216216216218,215,200,200,15,15,"Chris","Green","Conservative","Hold","Chris","Green","Conservative",5000,400,"Same MP"]
["North West","Bootle",2500,39000,6.4102564102564097,180,165,180,0,15,"Peter","Dowd","Labour","Hold","Peter","Dowd","Labour",2500,300,"Same MP"]
["East Midlands","Boston and Skegness",5000,45000,11.111111111111111,210,185,210,0,25,"Matt","Warman","Conservative","Hold","Matt","Warman","Conservative",4500,700,"Same MP"]
["East Midlands","Bosworth",7000,40000,17.5,390,400,400,-10,-10,"Luke","Evans","Conservative","Hold","David","Tredinnick","Conservative",6000,500,"New MP"]
["South West","Bournemouth East",350,38000,0.92105263157894723,130,120,135,-5,10,"Tobias","Ellwood","Conservative","Hold","Tobias","Ellwood","Conservative",300,50,"Same MP"]
["South West","Bournemouth West",1750,61000,2.8688524590163933,165,150,160,5,15,"Conor","Burns","Conservative","Hold","Conor","Burns","Conservative",1750,100,"Same MP"]
["South East","Bracknell",1500,52000,2.8846153846153846,160,165,160,0,-5,"James","Sunderland","Conservative","Change","Phillip","Lee","Liberal Democrat",1500,175,"New MP"]
["Yorkshire & the Humber","Bradford East",5000,37000,13.513513513513514,250,265,250,0,-15,"Imran","Hussain","Labour","Hold","Imran","Hussain","Labour",4500,350,"Same MP"]
["Yorkshire & the Humber","Bradford South",9000,37000,24.324324324324326,190,160,195,-5,30,"Judith","Cummins","Labour","Hold","Judith","Cummins","Labour",7000,1750,"Same MP"]
["Yorkshire & the Humber","Bradford West",5000,60000,8.3333333333333321,220,175,225,-5,45,"Naseem","Shah","Labour","Hold","Naseem","Shah","Labour",4500,450,"Same MP"]
["Eastern","Braintree",4000,35000,11.428571428571429,355,330,360,-5,25,"James","Cleverly","Conservative","Hold","James","Cleverly","Conservative",3500,450,"Same MP"]
["Wales","Brecon and Radnorshire",1750,25000,7.0000000000000009,175,160,180,-5,15,"Fay Alicia","Jones","Conservative","Change","Jane","Dodds","Liberal Democrat",1750,100,"New MP"]
["London","Brent Central",6000,62000,9.67741935483871,260,270,275,-15,-10,"Dawn","Butler","Labour","Hold","Dawn","Butler","Labour",6000,450,"Same MP"]
["London","Brent North",1500,51000,2.9411764705882351,175,165,180,-5,10,"Barry","Gardiner","Labour","Hold","Barry","Gardiner","Labour",1500,125,"Same MP"]
["London","Brentford and Isleworth",1500,105000,1.4285714285714286,210,180,210,0,30,"Ruth","Cadbury","Labour","Hold","Ruth","Cadbury","Labour",1250,100,"Same MP"]
["Eastern","Brentwood and Ongar",2000,43000,4.6511627906976747,275,240,265,10,35,"Alex","Burghart","Conservative","Hold","Alex","Burghart","Conservative",1750,250,"Same MP"]
["Wales","Bridgend",6000,43000,13.953488372093023,305,190,320,-15,115,"Jamie Hamilton","Wallis","Conservative","Change","Madeleine","Moon","Labour",6000,225,"New MP"]
["South West","Bridgwater and West Somerset",4500,43000,10.465116279069768,245,245,240,5,0,"Ian","Liddell-Grainger","Conservative","Hold","Ian","Liddell-Grainger","Conservative",4500,225,"Same MP"]
["Yorkshire & the Humber","Brigg and Goole",4000,31000,12.903225806451612,205,180,195,10,25,"Andrew","Percy","Conservative","Hold","Andrew","Percy","Conservative",4000,300,"Same MP"]
["South East","Brighton, Kemptown",600,34000,1.7647058823529411,90,85,90,0,5,"Lloyd","Russell-Moyle","Labour/Co-operative","Hold","Lloyd","Russell-Moyle","Labour/Co-operative",600,50,"Same MP"]
["South East","Brighton, Pavilion",900,69000,1.3043478260869565,185,160,170,15,25,"Caroline","Lucas","Green","Hold","Caroline","Lucas","Green",800,100,"Same MP"]
["South West","Bristol East",3000,28000,10.714285714285714,190,195,210,-20,-5,"Kerry","McCarthy","Labour","Hold","Kerry","McCarthy","Labour",2500,200,"Same MP"]
["South West","Bristol North West",2000,49000,4.0816326530612246,115,105,115,0,10,"Darren","Jones","Labour","Hold","Darren","Jones","Labour",1750,125,"Same MP"]
["South West","Bristol South",3000,35000,8.5714285714285712,180,160,175,5,20,"Karin","Smyth","Labour","Hold","Karin","Smyth","Labour",3000,300,"Same MP"]
["South West","Bristol West",1750,156000,1.1217948717948718,300,235,300,0,65,"Thangam","Debbonaire","Labour","Hold","Thangam","Debbonaire","Labour",1750,200,"Same MP"]
["Eastern","Broadland",4500,31000,14.516129032258066,315,300,310,5,15,"Jerome","Mayhew","Conservative","Hold","Keith","Simpson","Conservative",4000,450,"New MP"]
["London","Bromley and Chislehurst",400,40000,1,105,120,115,-10,-15,"Bob","Neill","Conservative","Hold","Bob","Neill","Conservative",350,50,"Same MP"]
["West Midlands","Bromsgrove",3000,49000,6.1224489795918364,275,245,275,0,30,"Sajid","Javid","Conservative","Hold","Sajid","Javid","Conservative",2500,300,"Same MP"]
["Eastern","Broxbourne",3000,36000,8.3333333333333321,230,230,235,-5,0,"Charles","Walker","Conservative","Hold","Charles","Walker","Conservative",2500,450,"Same MP"]
["East Midlands","Broxtowe",4500,32000,14.0625,155,160,155,0,-5,"Darren George","Henry","Conservative","Change","Anna","Soubry","Independent",4000,300,"New MP"]
["South East","Buckingham",4500,35000,12.857142857142856,385,345,375,10,40,"Greg","Smith","Conservative","Change","John","Bercow","Speaker",4500,300,"New MP"]
["North West","Burnley",7000,39000,17.948717948717949,260,225,250,10,35,"Antony","Higginbotham","Conservative","Change","Julie","Cooper","Labour",5000,1000,"New MP"]
["West Midlands","Burton",9000,56000,16.071428571428573,260,245,260,0,15,"Kate","Griffiths","Conservative","Hold","Andrew","Griffiths","Conservative",8000,600,"Same MP"]
["North West","Bury North",4000,42000,9.5238095238095237,210,215,230,-20,-5,"James","Daly","Conservative","Change","James","Frith","Labour",4000,300,"New MP"]
["North West","Bury South",3000,29000,10.344827586206897,190,165,190,0,25,"Christian","Wakeford","Conservative","Change","Ivan","Lewis","Independent",2500,350,"New MP"]
["Eastern","Bury St Edmunds",6000,67000,8.9552238805970141,235,250,235,0,-15,"Jo","Churchill","Conservative","Hold","Jo","Churchill","Conservative",5000,500,"Same MP"]
["Wales","Caerphilly",4500,30000,15,150,140,155,-5,10,"Wayne","David","Labour","Hold","Wayne","David","Labour",4500,250,"Same MP"]
["Scotland","Caithness, Sutherland and Easter Ross",2000,23000,8.695652173913043,200,180,195,5,20,"Jamie","Stone","Liberal Democrat","Hold","Jamie","Stone","Liberal Democrat",2000,200,"Same MP"]
["Yorkshire & the Humber","Calder Valley",9000,45000,20,435,430,435,0,5,"Craig","Whittaker","Conservative","Hold","Craig","Whittaker","Conservative",8000,700,"Same MP"]
["London","Camberwell and Peckham",800,33000,2.4242424242424243,135,100,140,-5,35,"Harriet","Harman","Labour","Hold","Harriet","Harman","Labour",600,100,"Same MP"]
["South West","Camborne and Redruth",2500,31000,8.064516129032258,200,190,210,-10,10,"George","Eustice","Conservative","Hold","George","Eustice","Conservative",2500,200,"Same MP"]
["Eastern","Cambridge",1750,86000,2.0348837209302326,190,145,170,20,45,"Daniel","Zeichner","Labour","Hold","Daniel","Zeichner","Labour",1500,200,"Same MP"]
["West Midlands","Cannock Chase",5000,42000,11.904761904761903,305,295,305,0,10,"Amanda","Milling","Conservative","Hold","Amanda","Milling","Conservative",4500,350,"Same MP"]
["South East","Canterbury",1500,56000,2.6785714285714284,175,150,170,5,25,"Rosie","Duffield","Labour","Hold","Rosie","Duffield","Labour",1250,125,"Same MP"]
["Wales","Cardiff Central",600,71000,0.84507042253521114,80,70,80,0,10,"Jo","Stevens","Labour","Hold","Jo","Stevens","Labour",600,75,"Same MP"]
["Wales","Cardiff North",2000,49000,4.0816326530612246,75,75,75,0,0,"Anna","McMorrin","Labour","Hold","Anna","McMorrin","Labour",2000,175,"Same MP"]
["Wales","Cardiff South and Penarth",5000,74000,6.756756756756757,215,225,220,-5,-10,"Stephen","Doughty","Labour/Co-operative","Hold","Stephen","Doughty","Labour/Co-operative",5000,350,"Same MP"]
["Wales","Cardiff West",1000,28000,3.5714285714285712,90,90,90,0,0,"Kevin","Brennan","Labour","Hold","Kevin","Brennan","Labour",900,75,"Same MP"]
["North West","Carlisle",5000,45000,11.111111111111111,115,125,120,-5,-10,"John","Stevenson","Conservative","Hold","John","Stevenson","Conservative",5000,400,"Same MP"]
["Wales","Carmarthen East and Dinefwr",2500,20000,12.5,185,180,185,0,5,"Jonathan","Edwards","Plaid Cymru","Hold","Jonathan","Edwards","Plaid Cymru",2500,125,"Same MP"]
["Wales","Carmarthen West and South Pembrokeshire",2000,35000,5.7142857142857144,195,180,175,20,15,"Simon","Hart","Conservative","Hold","Simon","Hart","Conservative",2000,100,"Same MP"]
["London","Carshalton and Wallington",1250,34000,3.6764705882352944,135,140,140,-5,-5,"Elliot","Colburn","Conservative","Change","Tom","Brake","Liberal Democrat",1000,150,"New MP"]
["Eastern","Castle Point",1500,21000,7.1428571428571423,185,200,190,-5,-15,"Rebecca","Harris","Conservative","Hold","Rebecca","Harris","Conservative",1250,225,"Same MP"]
["Scotland","Central Ayrshire",6000,36000,16.666666666666664,175,135,160,15,40,"Philippa","Whitford","Scottish National Party","Hold","Philippa","Whitford","Scottish National Party",6000,225,"Same MP"]
["South West","Central Devon",3500,29000,12.068965517241379,315,295,320,-5,20,"Mel","Stride","Conservative","Hold","Mel","Stride","Conservative",3000,250,"Same MP"]
["Eastern","Central Suffolk and North Ipswich",4000,36000,11.111111111111111,255,270,260,-5,-15,"Daniel","Poulter","Conservative","Hold","Daniel","Poulter","Conservative",3500,600,"Same MP"]
["Wales","Ceredigion",1250,26000,4.8076923076923084,155,160,155,0,-5,"Ben","Lake","Plaid Cymru","Hold","Ben","Lake","Plaid Cymru",1250,100,"Same MP"]
["East Midlands","Charnwood",5000,33000,15.151515151515152,280,260,285,-5,20,"Edward","Argar","Conservative","Hold","Edward","Argar","Conservative",4500,450,"Same MP"]
["South East","Chatham and Aylesford",2500,30000,8.3333333333333321,145,130,150,-5,15,"Tracey","Crouch","Conservative","Hold","Tracey","Crouch","Conservative",2250,250,"Same MP"]
["North West","Cheadle",2500,44000,5.6818181818181817,180,170,180,0,10,"Mary","Robinson","Conservative","Hold","Mary","Robinson","Conservative",2500,175,"Same MP"]
["Eastern","Chelmsford",2500,61000,4.0983606557377046,150,145,160,-10,5,"Vicky","Ford","Conservative","Hold","Vicky","Ford","Conservative",2250,300,"Same MP"]
["London","Chelsea and Fulham",900,68000,1.3235294117647058,225,185,220,{"$f":"F137-H137","v":5},{"$f":"F137-G137","v":40},"Greg","Hands","Conservative","Hold","Greg","Hands","Conservative",700,200,"Same MP"]
["South West","Cheltenham",2500,54000,4.6296296296296298,165,140,170,-5,25,"Alex","Chalk","Conservative",{"$f":"IF(M138=Q138, \"Hold\", \"Change\")","v":"Hold"},"Alex","Chalk","Conservative",2250,225,{"$f":"IF(L138=P138, \"Same MP\", \"New MP\")","v":"Same MP"}]
["South East","Chesham and Amersham",1750,34000,{"$f":"(C139/D139)*100","v":5.1470588235294112},210,205,220,-10,5,"Cheryl","Gillan","Conservative","Hold","Cheryl","Gillan","Conservative",1750,175,"Same MP"]
["East Midlands","Chesterfield",4000,49000,8.1632653061224492,290,260,275,15,30,"Toby","Perkins","Labour","Hold","Toby","Perkins","Labour",3500,400,"Same MP"]
["South East","Chichester",5000,56000,8.9285714285714288,345,335,345,0,10,"Gillian","Keegan","Conservative","Hold","Gillian","Keegan","Conservative",5000,250,"Same MP"]
["London","Chingford and Woodford Green",600,28000,2.1428571428571428,110,110,100,10,0,"Iain","Duncan Smith","Conservative","Hold","Iain","Duncan Smith","Conservative",500,100,"Same MP"]
["South West","Chippenham",6000,43000,13.953488372093023,240,215,240,0,25,"Michelle","Donelan","Conservative","Hold","Michelle","Donelan","Conservative",5000,350,"Same MP"]
["London","Chipping Barnet",450,34000,1.3235294117647058,135,145,135,0,-10,"Theresa","Villiers","Conservative","Hold","Theresa","Villiers","Conservative",400,75,"Same MP"]
["North West","Chorley",2500,35000,7.1428571428571423,215,195,220,-5,20,"Lindsay","Hoyle","Speaker","Change","Lindsay","Hoyle","Labour",2250,225,"Same MP"]
["South West","Christchurch",4500,37000,12.162162162162163,295,265,285,10,30,"Christopher","Chope","Conservative","Hold","Christopher","Chope","Conservative",4000,350,"Same MP"]
["London","Cities of London and Westminster",9000,1181000,0.76206604572396275,1015,755,985,30,260,"Nickie","Aiken","Conservative","Hold","Mark","Field","Conservative",8000,1250,"New MP"]
["North West","City of Chester",1750,69000,2.5362318840579712,175,125,150,25,50,"Chris","Matheson","Labour","Hold","Chris","Matheson","Labour",1500,175,"Same MP"]
["North East","City of Durham",1250,46000,2.7173913043478262,105,90,95,10,15,"Mary","Foy","Labour","Hold","Roberta","Blackman-Woods","Labour",1000,175,"New MP"]
["Eastern","Clacton",1250,21000,5.9523809523809517,130,120,135,-5,10,"Giles","Watling","Conservative","Hold","Giles","Watling","Conservative",1000,200,"Same MP"]
["Yorkshire & the Humber","Cleethorpes",8000,39000,20.512820512820511,205,180,200,5,25,"Martin","Vickers","Conservative","Hold","Martin","Vickers","Conservative",8000,350,"Same MP"]
["Wales","Clwyd South",3500,17000,20.588235294117645,130,130,135,-5,0,"Simon","Baynes","Conservative","Change","Susan Elan","Jones","Labour",3000,175,"New MP"]
["Wales","Clwyd West",1000,25000,4,135,105,125,10,30,"David","Jones","Conservative","Hold","David","Jones","Conservative",1000,75,"Same MP"]
["Scotland","Coatbridge, Chryston and Bellshill",4500,45000,10,150,115,135,15,35,"Steven","Bonnar","Scottish National Party","Change","Hugh","Gaffney","Labour",4500,350,"New MP"]
["Eastern","Colchester",3000,59000,5.0847457627118651,165,160,165,0,5,"Will","Quince","Conservative","Hold","Will","Quince","Conservative",2500,300,"Same MP"]
["Yorkshire & the Humber","Colne Valley",4500,27000,16.666666666666664,335,315,335,0,20,"Jason","McCartney","Conservative","Change","Thelma","Walker","Labour",4500,400,"New MP"]
["North West","Congleton",4500,33000,13.636363636363635,285,250,280,5,35,"Fiona","Bruce","Conservative","Hold","Fiona","Bruce","Conservative",4000,400,"Same MP"]
["North West","Copeland",12000,38000,31.578947368421051,145,135,145,0,10,"Trudy","Harrison","Conservative","Hold","Trudy","Harrison","Conservative",10000,600,"Same MP"]
["East Midlands","Corby",10000,51000,19.607843137254903,335,300,320,15,35,"Tom","Pursglove","Conservative","Hold","Tom","Pursglove","Conservative",9000,700,"Same MP"]
["West Midlands","Coventry North East",4500,53000,8.4905660377358494,275,270,275,0,5,"Colleen","Fletcher","Labour","Hold","Colleen","Fletcher","Labour",4500,300,"Same MP"]
["West Midlands","Coventry North West",2250,22000,10.227272727272728,150,135,135,15,15,"Taiwo","Owatemi","Labour","Hold","Geoffrey","Robinson","Labour",2000,175,"New MP"]
["West Midlands","Coventry South",11000,86000,12.790697674418606,280,240,270,10,40,"Zarah","Sultana","Labour","Hold","Jim","Cunningham","Labour",10000,450,"New MP"]
["South East","Crawley",7000,94000,7.4468085106382977,160,140,160,0,20,"Henry","Smith","Conservative","Hold","Henry","Smith","Conservative",7000,500,"Same MP"]
["North West","Crewe and Nantwich",9000,52000,17.307692307692307,180,185,190,-10,-5,"Kieran John","Mullan","Conservative","Change","Laura","Smith","Labour",8000,350,"New MP"]
["London","Croydon Central",500,51000,0.98039215686274506,130,100,120,10,30,"Sarah","Jones","Labour","Hold","Sarah","Jones","Labour",450,45,"Same MP"]
["London","Croydon North",900,39000,2.3076923076923079,170,145,150,20,25,"Steve","Reed","Labour/Co-operative","Hold","Steve","Reed","Labour/Co-operative",800,175,"Same MP"]
["London","Croydon South",700,32000,2.1875,165,140,155,10,25,"Chris","Philp","Conservative","Hold","Chris","Philp","Conservative",600,100,"Same MP"]
["Scotland","Cumbernauld, Kilsyth and Kirkintilloch East",3500,38000,9.2105263157894726,150,130,145,5,20,"Stuart","McDonald","Scottish National Party","Hold","Stuart","McDonald","Scottish National Party",3000,300,"Same MP"]
["Wales","Cynon Valley",1750,16000,10.9375,100,80,105,-5,20,"Beth","Winter","Labour","Hold","Ann","Clwyd","Labour",1500,75,"New MP"]
["London","Dagenham and Rainham",4000,30000,13.333333333333334,170,155,170,0,15,"Jon","Cruddas","Labour","Hold","Jon","Cruddas","Labour",4000,150,"Same MP"]
["North East","Darlington",3000,40000,7.5,140,115,145,-5,25,"Peter","Gibson","Conservative","Change","Jenny","Chapman","Labour",3000,250,"New MP"]
["South East","Dartford",3500,63000,5.5555555555555554,225,225,235,-10,0,"Gareth","Johnson","Conservative","Hold","Gareth","Johnson","Conservative",3500,250,"Same MP"]
["East Midlands","Daventry",6000,49000,12.244897959183673,345,330,345,0,15,"Chris","Heaton-Harris","Conservative","Hold","Chris","Heaton-Harris","Conservative",6000,400,"Same MP"]
["Wales","Delyn",4500,25000,18,160,130,155,5,30,"Rob","Roberts","Conservative","Change","David","Hanson","Labour",4500,225,"New MP"]
["North West","Denton and Reddish",5000,25000,20,270,255,275,-5,15,"Andrew","Gwynne","Labour","Hold","Andrew","Gwynne","Labour",5000,450,"Same MP"]
["East Midlands","Derby North",2250,45000,5,210,215,210,0,-5,"Amanda","Solloway","Conservative","Change","Chris","Williamson","Independent",1750,400,"New MP"]
["East Midlands","Derby South",24000,81000,29.629629629629626,205,200,195,10,5,"Margaret","Beckett","Labour","Hold","Margaret","Beckett","Labour",23000,1250,"Same MP"]
["East Midlands","Derbyshire Dales",5000,36000,13.888888888888889,295,270,300,-5,25,"Sarah Elizabeth","Dines","Conservative","Hold","Patrick","McLoughlin","Conservative",5000,400,"New MP"]
["South West","Devizes",3000,32000,9.375,215,205,205,10,10,"Danny","Kruger","Conservative","Hold","Claire","Perry","Conservative",3000,200,"New MP"]
["Yorkshire & the Humber","Dewsbury",9000,36000,25,400,370,395,5,30,"Mark","Eastwood","Conservative","Change","Paula","Sherriff","Labour",8000,800,"New MP"]
["Yorkshire & the Humber","Don Valley",3500,27000,12.962962962962962,170,135,155,15,35,"Nicholas","Fletcher","Conservative","Change","Caroline","Flint","Labour",3500,250,"New MP"]
["Yorkshire & the Humber","Doncaster Central",6000,71000,8.4507042253521121,220,165,205,15,55,"Rosie","Winterton","Labour","Hold","Rosie","Winterton","Labour",6000,500,"Same MP"]
["Yorkshire & the Humber","Doncaster North",1500,22000,6.8181818181818175,150,140,165,-15,10,"Ed","Miliband","Labour","Hold","Ed","Miliband","Labour",1250,100,"Same MP"]
["South East","Dover",2500,27000,9.2592592592592595,135,125,130,5,10,"Natalie","Elphicke","Conservative","Change","Charlie","Elphicke","Independent",2500,125,"Same MP"]
["West Midlands","Dudley North",2000,29000,6.8965517241379306,160,135,155,5,25,"Marco","Longhi","Conservative","Change","Ian","Austin","Independent",1750,250,"New MP"]
["West Midlands","Dudley South",8000,40000,20,410,385,390,20,25,"Mike","Wood","Conservative","Hold","Mike","Wood","Conservative",7000,700,"Same MP"]
["London","Dulwich and West Norwood",600,36000,1.6666666666666667,145,145,145,0,0,"Helen","Hayes","Labour","Hold","Helen","Hayes","Labour",450,150,"Same MP"]
["Scotland","Dumfries and Galloway",2500,35000,7.1428571428571423,175,145,180,-5,30,"Alister","Jack","Conservative","Hold","Alister","Jack","Conservative",2250,400,"Same MP"]
["Scotland","Dumfriesshire, Clydesdale and Tweeddale",3500,29000,12.068965517241379,195,175,190,5,20,"David","Mundell","Conservative","Hold","David","Mundell","Conservative",3000,350,"Same MP"]
["Scotland","Dundee East",2500,25000,10,85,90,85,0,-5,"Stewart","Hosie","Scottish National Party","Hold","Stewart","Hosie","Scottish National Party",2250,400,"Same MP"]
["Scotland","Dundee West",2250,55000,4.0909090909090908,135,125,120,15,10,"Chris","Law","Scottish National Party","Hold","Chris","Law","Scottish National Party",2000,200,"Same MP"]
["Scotland","Dunfermline and West Fife",4000,41000,9.7560975609756095,155,125,150,5,30,"Douglas","Chapman","Scottish National Party","Hold","Douglas","Chapman","Scottish National Party",4000,150,"Same MP"]
["Wales","Dwyfor Meirionnydd",1500,20000,7.5,130,125,135,-5,5,"Liz","Saville-Roberts","Plaid Cymru","Hold","Liz","Saville-Roberts","Plaid Cymru",1500,75,"Same MP"]
["London","Ealing Central and Acton",6000,68000,8.8235294117647065,305,295,305,0,10,"Rupa","Huq","Labour","Hold","Rupa","Huq","Labour",6000,450,"Same MP"]
["London","Ealing North",2250,32000,7.03125,190,170,190,0,20,"James","Murray","Labour/Co-operative","Change","Steve","Pound","Labour",2250,150,"New MP"]
["London","Ealing, Southall",3500,27000,12.962962962962962,145,155,150,-5,-10,"Virendra","Sharma","Labour","Hold","Virendra","Sharma","Labour",3000,200,"Same MP"]
["North East","Easington",5000,26000,19.230769230769234,105,95,105,0,10,"Grahame","Morris","Labour","Hold","Grahame","Morris","Labour",4500,300,"Same MP"]
["Northern Ireland","East Antrim",null,null,{"$error":"#DIV/0!"},170,110,155,15,60,"Sammy","Wilson","DUP","Hold","Sammy","Wilson","DUP",null,null,"Same MP"]
["South West","East Devon",2500,53000,4.716981132075472,205,150,195,10,55,"Simon","Jupp","Conservative","Hold","Hugo","Swire","Conservative",2250,225,"New MP"]
["Scotland","East Dunbartonshire",1250,21000,5.9523809523809517,95,95,85,10,0,"Amy","Callaghan","Scottish National Party","Change","Jo","Swinson","Liberal Democrat",1000,75,"New MP"]
["London","East Ham",2000,37000,5.4054054054054053,145,110,140,{"$f":"F201-H201","v":5},{"$f":"F201-G201","v":35},"Stephen","Timms","Labour","Hold","Stephen","Timms","Labour",2000,175,"Same MP"]
["South East","East Hampshire",4000,38000,10.526315789473683,305,290,300,5,15,"Damian","Hinds","Conservative",{"$f":"IF(M202=Q202, \"Hold\", \"Change\")","v":"Hold"},"Damian","Hinds","Conservative",3500,300,{"$f":"IF(L202=P202, \"Same MP\", \"New MP\")","v":"Same MP"}]
["Scotland","East Kilbride, Strathaven and Lesmahagow",4000,38000,{"$f":"(C203/D203)*100","v":10.526315789473683},210,195,215,-5,15,"Lisa","Cameron","Scottish National Party","Hold","Lisa","Cameron","Scottish National Party",3500,400,"Same MP"]
["Northern Ireland","East Londonderry",null,null,{"$error":"#DIV/0!"},190,170,200,-10,20,"Gregory","Campbell","DUP","Hold","Gregory","Campbell","DUP",null,null,"Same MP"]
["Scotland","East Lothian",2000,30000,6.666666666666667,150,120,145,5,30,"Kenny","MacAskill","Scottish National Party","Change","Martin","Whitfield","Labour",1750,175,"New MP"]
["Scotland","East Renfrewshire",600,22000,2.7272727272727271,105,95,115,-10,10,"Kirsten","Oswald","Scottish National Party","Change","Paul","Masterton","Conservative",500,75,"New MP"]
["South East","East Surrey",1250,38000,3.2894736842105261,215,230,230,-15,-15,"Claire","Coutinho","Conservative","Change","Sam","Gyimah","Independent",1000,125,"New MP"]
["South East","East Worthing and Shoreham",5000,33000,15.151515151515152,235,215,250,-15,20,"Tim","Loughton","Conservative","Hold","Tim","Loughton","Conservative",4500,400,"Same MP"]
["Yorkshire & the Humber","East Yorkshire",6000,32000,18.75,280,270,280,0,10,"Greg","Knight","Conservative","Hold","Greg","Knight","Conservative",5000,450,"Same MP"]
["South East","Eastbourne",1500,40000,3.75,140,130,130,10,10,"Caroline","Ansell","Conservative","Change","Stephen","Lloyd","Independent",1250,150,"New MP"]
["South East","Eastleigh",5000,55000,9.0909090909090917,300,250,300,0,50,"Paul","Holmes","Conservative","Hold","Mims","Davies","Conservative",5000,450,"New MP"]
["North West","Eddisbury",4500,39000,11.538461538461538,235,205,215,20,30,"Edward","Timpson","Conservative","Change","Antoinette","Sandbach","Independent",3500,600,"New MP"]
["Scotland","Edinburgh East",1250,78000,1.6025641025641024,130,90,120,10,40,"Tommy","Sheppard","Scottish National Party","Hold","Tommy","Sheppard","Scottish National Party",1000,200,"Same MP"]
["Scotland","Edinburgh North and Leith",4000,111000,3.6036036036036037,185,145,180,5,40,"Deidre","Brock","Scottish National Party","Hold","Deidre","Brock","Scottish National Party",4000,250,"Same MP"]
["Scotland","Edinburgh South",500,27000,1.8518518518518516,65,40,55,10,25,"Ian","Murray","Labour","Hold","Ian","Murray","Labour",400,100,"Same MP"]
["Scotland","Edinburgh South West",1750,71000,2.464788732394366,90,75,80,10,15,"Joanna","Cherry","Scottish National Party","Hold","Joanna","Cherry","Scottish National Party",1750,150,"Same MP"]
["Scotland","Edinburgh West",900,59000,1.5254237288135595,70,70,70,0,0,"Christine","Jardine","Liberal Democrat","Hold","Christine","Jardine","Liberal Democrat",900,50,"Same MP"]
["London","Edmonton",2250,33000,6.8181818181818175,215,220,215,0,-5,"Kate","Osamor","Labour/Co-operative","Hold","Kate","Osamor","Labour/Co-operative",2000,400,"Same MP"]
["North West","Ellesmere Port and Neston",6000,37000,16.216216216216218,155,150,155,0,5,"Justin","Madders","Labour","Hold","Justin","Madders","Labour",6000,225,"Same MP"]
["Yorkshire & the Humber","Elmet and Rothwell",3000,38000,7.8947368421052628,205,195,205,0,10,"Alec","Shelbrooke","Conservative","Hold","Alec","Shelbrooke","Conservative",2500,250,"Same MP"]
["London","Eltham",100,18000,0.55555555555555558,85,65,75,10,20,"Clive","Efford","Labour","Hold","Clive","Efford","Labour",100,20,"Same MP"]
["London","Enfield North",2500,42000,5.9523809523809517,135,110,135,0,25,"Feryal","Clark","Labour","Change","Joan","Ryan","Independent",2500,175,"New MP"]
["London","Enfield, Southgate",300,29000,1.0344827586206897,125,140,120,5,-15,"Bambos","Charalambous","Labour","Hold","Bambos","Charalambous","Labour",250,50,"Same MP"]
["Eastern","Epping Forest",1500,40000,3.75,190,165,185,5,25,"Eleanor","Laing","Conservative","Hold","Eleanor","Laing","Conservative",1250,175,"Same MP"]
["South East","Epsom and Ewell",300,38000,0.78947368421052633,120,105,130,-10,15,"Chris","Grayling","Conservative","Hold","Chris","Grayling","Conservative",300,35,"Same MP"]
["East Midlands","Erewash",7000,35000,20,375,350,385,-10,25,"Maggie","Throup","Conservative","Hold","Maggie","Throup","Conservative",7000,600,"Same MP"]
["London","Erith and Thamesmead",2500,30000,8.3333333333333321,155,150,145,10,5,"Abena","Oppong-Asare","Labour","Hold","Teresa","Pearce","Labour",2500,225,"New MP"]
["South East","Esher and Walton",1250,41000,3.0487804878048781,180,190,175,5,-10,"Dominic","Raab","Conservative","Hold","Dominic","Raab","Conservative",1250,125,"Same MP"]
["South West","Exeter",1250,72000,1.7361111111111112,160,130,150,10,30,"Ben","Bradshaw","Labour","Hold","Ben","Bradshaw","Labour",1000,150,"Same MP"]
["Scotland","Falkirk",4000,48000,8.3333333333333321,190,150,190,0,40,"John","McNally","Scottish National Party","Hold","John","McNally","Scottish National Party",3500,400,"Same MP"]
["South East","Fareham",4500,44000,10.227272727272728,280,260,285,-5,20,"Suella","Braverman","Conservative","Hold","Suella","Braverman","Conservative",4000,300,"Same MP"]
["South East","Faversham and Mid Kent",3000,36000,8.3333333333333321,250,210,250,0,40,"Helen","Whately","Conservative","Hold","Helen","Whately","Conservative",3000,250,"Same MP"]
["London","Feltham and Heston",2000,52000,3.8461538461538463,145,140,140,5,5,"Seema","Malhotra","Labour/Co-operative","Hold","Seema","Malhotra","Labour/Co-operative",1750,200,"Same MP"]
["Northern Ireland","Fermanagh & South Tyrone",null,null,{"$error":"#DIV/0!"},390,355,370,20,35,"Michelle","Gildernew","Sinn Fein","Hold","Michelle","Gildernew","Sinn Fein",null,null,"Same MP"]
["South West","Filton and Bradley Stoke",11000,89000,12.359550561797752,130,125,135,-5,5,"Jack","Lopresti","Conservative","Hold","Jack","Lopresti","Conservative",11000,400,"Same MP"]
["London","Finchley and Golders Green",800,49000,1.6326530612244898,215,175,235,-20,40,"Mike","Freer","Conservative","Hold","Mike","Freer","Conservative",700,125,"Same MP"]
["South East","Folkestone and Hythe",2000,37000,5.4054054054054053,190,165,185,5,25,"Damian","Collins","Conservative","Hold","Damian","Collins","Conservative",2000,150,"Same MP"]
["South West","Forest of Dean",4000,25000,16,285,250,270,15,35,"Mark","Harper","Conservative","Hold","Mark","Harper","Conservative",3500,250,"Same MP"]
["Northern Ireland","Foyle",null,null,{"$error":"#DIV/0!"},145,150,140,5,-5,"Colum","Eastwood","Social Democratic and Labour Party","Change","Elisha","McCallion","Sinn Fein",null,null,"New MP"]
["North West","Fylde",10000,39000,25.641025641025639,170,160,175,-5,10,"Mark","Menzies","Conservative","Hold","Mark","Menzies","Conservative",9000,400,"Same MP"]
["East Midlands","Gainsborough",3500,25000,14.000000000000002,220,195,215,5,25,"Edward","Leigh","Conservative","Hold","Edward","Leigh","Conservative",3000,300,"Same MP"]
["North West","Garston and Halewood",11000,48000,22.916666666666664,160,135,155,5,25,"Maria","Eagle","Labour","Hold","Maria","Eagle","Labour",10000,250,"Same MP"]
["North East","Gateshead",6000,56000,10.714285714285714,170,170,170,0,0,"Ian","Mearns","Labour","Hold","Ian","Mearns","Labour",5000,400,"Same MP"]
["East Midlands","Gedling",3000,25000,12,160,155,155,5,5,"Tom","Randall","Conservative","Change","Vernon","Coaker","Labour",2500,400,"New MP"]
["South East","Gillingham and Rainham",1750,29000,6.0344827586206895,125,105,120,5,20,"Rehman","Chishti","Conservative","Hold","Rehman","Chishti","Conservative",1750,100,"Same MP"]
["Scotland","Glasgow Central",4000,224000,1.7857142857142856,285,230,280,5,55,"Alison","Thewliss","Scottish National Party","Hold","Alison","Thewliss","Scottish National Party",3500,400,"Same MP"]
["Scotland","Glasgow East",3500,35000,10,145,135,145,0,10,"David","Linden","Scottish National Party","Hold","David","Linden","Scottish National Party",3000,225,"Same MP"]
["Scotland","Glasgow North",900,27000,3.3333333333333335,90,70,90,0,20,"Patrick","Grady","Scottish National Party","Hold","Patrick","Grady","Scottish National Party",800,75,"Same MP"]
["Scotland","Glasgow North East",2500,38000,6.5789473684210522,115,80,105,10,35,"Anne","McLaughlin","Scottish National Party","Change","Paul","Sweeney","Labour",2500,225,"New MP"]
["Scotland","Glasgow North West",3500,25000,14.000000000000002,75,60,75,0,15,"Carol","Monaghan","Scottish National Party","Hold","Carol","Monaghan","Scottish National Party",3000,200,"Same MP"]
["Scotland","Glasgow South",900,15000,6,75,55,65,10,20,"Stewart","McDonald","Scottish National Party","Hold","Stewart","McDonald","Scottish National Party",800,100,"Same MP"]
["Scotland","Glasgow South West",3000,45000,6.666666666666667,110,95,115,-5,15,"Chris","Stephens","Scottish National Party","Hold","Chris","Stephens","Scottish National Party",3000,175,"Same MP"]
["Scotland","Glenrothes",6000,33000,18.181818181818183,190,150,185,5,40,"Peter","Grant","Scottish National Party","Hold","Peter","Grant","Scottish National Party",5000,450,"Same MP"]
["South West","Gloucester",4000,62000,6.4516129032258061,220,210,220,0,10,"Richard","Graham","Conservative","Hold","Richard","Graham","Conservative",3500,400,"Same MP"]
["Scotland","Gordon",8000,63000,12.698412698412698,300,300,305,-5,0,"Richard Gordon","Thomson","Scottish National Party","Change","Colin","Clark","Conservative",7000,600,"New MP"]
["South East","Gosport",3000,24000,12.5,195,165,205,-10,30,"Caroline","Dinenage","Conservative","Hold","Caroline","Dinenage","Conservative",3000,175,"Same MP"]
["Wales","Gower",1500,19000,7.8947368421052628,150,120,155,-5,30,"Tonia","Antoniazzi","Labour","Hold","Tonia","Antoniazzi","Labour",1500,50,"Same MP"]
["East Midlands","Grantham and Stamford",6000,45000,13.333333333333334,245,235,245,0,10,"Gareth","Davies","Conservative","Change","Nicholas","Boles","Independent",5000,400,"New MP"]
["South East","Gravesham",2000,32000,6.25,200,170,195,5,30,"Adam","Holloway","Conservative","Hold","Adam","Holloway","Conservative",1750,125,"Same MP"]
["Yorkshire & the Humber","Great Grimsby",7000,40000,17.5,190,165,190,0,25,"Lia","Nici","Conservative","Change","Melanie","Onn","Labour",6000,600,"New MP"]
["Eastern","Great Yarmouth",2500,37000,6.756756756756757,200,180,190,10,20,"Brandon","Lewis","Conservative","Hold","Brandon","Lewis","Conservative",2250,250,"Same MP"]
["London","Greenwich and Woolwich",2000,56000,3.5714285714285712,175,180,175,0,-5,"Matthew","Pennycook","Labour","Hold","Matthew","Pennycook","Labour",2000,200,"Same MP"]
["South East","Guildford",4000,73000,5.4794520547945202,180,180,180,0,0,"Angela Joy","Richardson","Conservative","Change","Anne","Milton","Independent",4000,200,"New MP"]
["London","Hackney North and Stoke Newington",800,31000,2.5806451612903225,195,180,200,-5,15,"Diane","Abbott","Labour","Hold","Diane","Abbott","Labour",700,175,"Same MP"]
["London","Hackney South and Shoreditch",1750,95000,1.8421052631578945,435,325,410,{"$f":"F265-H265","v":25},{"$f":"F265-G265","v":110},"Meg","Hillier","Labour/Co-operative","Hold","Meg","Hillier","Labour/Co-operative",1500,350,"Same MP"]
["West Midlands","Halesowen and Rowley Regis",5000,29000,17.241379310344829,325,345,320,5,-20,"James","Morris","Conservative",{"$f":"IF(M266=Q266, \"Hold\", \"Change\")","v":"Hold"},"James","Morris","Conservative",4500,600,{"$f":"IF(L266=P266, \"Same MP\", \"New MP\")","v":"Same MP"}]
["Yorkshire & the Humber","Halifax",5000,46000,{"$f":"(C267/D267)*100","v":10.869565217391305},280,285,275,5,-5,"Holly","Lynch","Labour","Hold","Holly","Lynch","Labour",4500,350,"Same MP"]
["Yorkshire & the Humber","Haltemprice and Howden",6000,34000,17.647058823529413,230,195,225,5,35,"David","Davis","Conservative","Hold","David","Davis","Conservative",6000,400,"Same MP"]
["North West","Halton",4000,34000,11.76470588235294,210,195,220,-10,15,"Derek","Twigg","Labour","Hold","Derek","Twigg","Labour",3500,250,"Same MP"]
["London","Hammersmith",1250,106000,1.179245283018868,190,170,175,15,20,"Andrew","Slaughter","Labour","Hold","Andrew","Slaughter","Labour",1250,125,"Same MP"]
["London","Hampstead and Kilburn",500,48000,1.0416666666666665,175,160,170,5,15,"Tulip","Siddiq","Labour","Hold","Tulip","Siddiq","Labour",450,75,"Same MP"]
["East Midlands","Harborough",4500,38000,11.842105263157894,340,340,330,10,0,"Neil","O'Brien","Conservative","Hold","Neil","O'Brien","Conservative",4000,450,"Same MP"]
["Eastern","Harlow",3500,46000,7.608695652173914,275,250,270,5,25,"Robert","Halfon","Conservative","Hold","Robert","Halfon","Conservative",3000,350,"Same MP"]
["Yorkshire & the Humber","Harrogate and Knaresborough",2500,54000,4.6296296296296298,220,205,205,15,15,"Andrew","Jones","Conservative","Hold","Andrew","Jones","Conservative",2500,250,"Same MP"]
["London","Harrow East",1250,26000,4.8076923076923084,160,110,150,10,50,"Bob","Blackman","Conservative","Hold","Bob","Blackman","Conservative",1250,100,"Same MP"]
["London","Harrow West",400,37000,1.0810810810810811,140,130,150,-10,10,"Gareth","Thomas","Labour/Co-operative","Hold","Gareth","Thomas","Labour/Co-operative",350,75,"Same MP"]
["North East","Hartlepool",3500,29000,12.068965517241379,185,155,175,10,30,"Mike","Hill","Labour","Hold","Mike","Hill","Labour",3500,175,"Same MP"]
["Eastern","Harwich and North Essex",2250,33000,6.8181818181818175,260,255,265,-5,5,"Bernard","Jenkin","Conservative","Hold","Bernard","Jenkin","Conservative",2000,300,"Same MP"]
["South East","Hastings and Rye",3000,36000,8.3333333333333321,225,220,235,-10,5,"Sally-Ann","Hart","Conservative","Change","Amber","Rudd","Independent",2500,300,"New MP"]
["South East","Havant",3500,33000,10.606060606060606,190,185,180,10,5,"Alan","Mak","Conservative","Hold","Alan","Mak","Conservative",3000,300,"Same MP"]
["London","Hayes and Harlington",3500,92000,3.804347826086957,185,160,180,5,25,"John Martin","McDonnell","Labour","Hold","John Martin","McDonnell","Labour",3500,200,"Same MP"]
["North West","Hazel Grove",2500,21000,11.904761904761903,210,185,190,20,25,"William","Wragg","Conservative","Hold","William","Wragg","Conservative",2250,200,"Same MP"]
["Eastern","Hemel Hempstead",2500,53000,4.716981132075472,210,205,205,5,5,"Mike","Penning","Conservative","Hold","Mike","Penning","Conservative",2250,250,"Same MP"]
["Yorkshire & the Humber","Hemsworth",2500,26000,9.6153846153846168,145,135,145,0,10,"Jon","Trickett","Labour","Hold","Jon","Trickett","Labour",2250,175,"Same MP"]
["London","Hendon",1750,48000,3.6458333333333335,165,160,170,-5,5,"Matthew","Offord","Conservative","Hold","Matthew","Offord","Conservative",1250,300,"Same MP"]
["South East","Henley",3000,44000,6.8181818181818175,320,305,300,20,15,"John","Howell","Conservative","Hold","John","Howell","Conservative",3000,250,"Same MP"]
["West Midlands","Hereford and South Herefordshire",7000,48000,14.583333333333334,280,275,285,-5,5,"Jesse","Norman","Conservative","Hold","Jesse","Norman","Conservative",6000,600,"Same MP"]
["Eastern","Hertford and Stortford",4000,72000,5.5555555555555554,350,305,315,35,45,"Julie","Marson","Conservative","Hold","Mark","Prisk","Conservative",3500,400,"New MP"]
["Eastern","Hertsmere",1500,53000,2.8301886792452833,250,225,245,5,25,"Oliver","Dowden","Conservative","Hold","Oliver","Dowden","Conservative",1250,225,"Same MP"]
["North East","Hexham",2250,25000,9,155,160,150,5,-5,"Guy","Opperman","Conservative","Hold","Guy","Opperman","Conservative",2000,250,"Same MP"]
["North West","Heywood and Middleton",5000,36000,13.888888888888889,220,205,215,5,15,"Chris","Clarkson","Conservative","Change","Liz","McInnes","Labour",4500,400,"New MP"]
["East Midlands","High Peak",6000,32000,18.75,290,280,285,5,10,"Robert","Largan","Conservative","Change","Ruth","George","Labour",6000,400,"New MP"]
["Eastern","Hitchin and Harpenden",1750,47000,3.7234042553191489,200,215,200,0,-15,"Bim","Afolami","Conservative","Hold","Bim","Afolami","Conservative",1500,200,"Same MP"]
["London","Holborn and St Pancras",3500,326000,1.0736196319018405,920,505,735,185,415,"Keir","Starmer","Labour","Hold","Keir","Starmer","Labour",3000,500,"Same MP"]
["London","Hornchurch and Upminster",1250,35000,3.5714285714285712,155,155,150,5,0,"Julia","Lopez","Conservative","Hold","Julia","Lopez","Conservative",1000,100,"Same MP"]
["London","Hornsey and Wood Green",900,34000,2.6470588235294117,180,170,175,5,10,"Catherine","West","Labour","Hold","Catherine","West","Labour",800,150,"Same MP"]
["South East","Horsham",2250,45000,5,285,265,275,10,20,"Jeremy","Quin","Conservative","Hold","Jeremy","Quin","Conservative",2000,200,"Same MP"]
["North East","Houghton and Sunderland South",1750,24000,7.291666666666667,85,80,85,0,5,"Bridget","Phillipson","Labour","Hold","Bridget","Phillipson","Labour",1500,200,"Same MP"]
["South East","Hove",1000,38000,2.6315789473684208,175,180,170,5,-5,"Peter","Kyle","Labour","Hold","Peter","Kyle","Labour",1000,125,"Same MP"]
["Yorkshire & the Humber","Huddersfield",6000,50000,12,205,205,195,10,0,"Barry","Sheerman","Labour/Co-operative","Hold","Barry","Sheerman","Labour/Co-operative",5000,400,"Same MP"]
["Eastern","Huntingdon",9000,58000,15.517241379310345,390,335,350,40,55,"Jonathan","Djanogly","Conservative","Hold","Jonathan","Djanogly","Conservative",8000,900,"Same MP"]
["North West","Hyndburn",8000,33000,24.242424242424242,295,320,310,-15,-25,"Sara","Britcliffe","Conservative","Change","Graham","Jones","Labour",7000,450,"New MP"]
["London","Ilford North",800,25000,3.2,150,160,150,0,-10,"Wes","Streeting","Labour","Hold","Wes","Streeting","Labour",700,100,"Same MP"]
["London","Ilford South",600,41000,1.4634146341463417,140,125,135,5,15,"Sam","Tarry","Labour","Change","Mike","Gapes","Independent",500,75,"New MP"]
["Scotland","Inverclyde",1750,27000,6.481481481481481,95,70,100,-5,25,"Ronnie","Cowan","Scottish National Party","Hold","Ronnie","Cowan","Scottish National Party",1500,125,"Same MP"]
["Scotland","Inverness, Nairn, Badenoch and Strathspey",2500,60000,4.1666666666666661,185,155,180,5,30,"Drew","Hendry","Scottish National Party","Hold","Drew","Hendry","Scottish National Party",2250,250,"Same MP"]
["Eastern","Ipswich",1750,62000,2.82258064516129,125,130,135,-10,-5,"Tom","Hunt","Conservative","Change","Sandy","Martin","Labour",1500,150,"New MP"]
["South East","Isle of Wight",5000,50000,10,325,250,300,25,75,"Bob","Seely","Conservative","Hold","Bob","Seely","Conservative",4500,500,"Same MP"]
["London","Islington North",450,33000,1.3636363636363635,135,135,135,0,0,"Jeremy","Corbyn","Labour","Hold","Jeremy","Corbyn","Labour",350,100,"Same MP"]
["London","Islington South and Finsbury",2500,198000,1.2626262626262625,410,305,375,35,105,"Emily","Thornberry","Labour","Hold","Emily","Thornberry","Labour",2000,300,"Same MP"]
["Wales","Islwyn",7000,21000,33.333333333333329,170,145,165,5,25,"Chris","Evans","Labour/Co-operative","Hold","Chris","Evans","Labour/Co-operative",7000,300,"Same MP"]
["North East","Jarrow",4500,25000,18,165,150,170,-5,15,"Kate","Osborne","Labour","Hold","Stephen","Hepburn","Labour",4000,300,"New MP"]
["Yorkshire & the Humber","Keighley",5000,34000,14.705882352941178,295,315,285,10,-20,"Robbie","Moore","Conservative","Change","John","Grogan","Labour",4500,450,"New MP"]
["West Midlands","Kenilworth and Southam",12000,46000,26.086956521739129,265,265,260,5,0,"Jeremy","Wright","Conservative","Hold","Jeremy","Wright","Conservative",12000,450,"Same MP"]
["London","Kensington",1000,101000,0.99009900990099009,225,205,230,-5,20,"Felicity","Buchan","Conservative","Change","Emma","Dent Coad","Labour",900,250,"New MP"]
["East Midlands","Kettering",5000,46000,10.869565217391305,255,245,265,-10,10,"Philip","Hollobone","Conservative","Hold","Philip","Hollobone","Conservative",5000,450,"Same MP"]
["Scotland","Kilmarnock and Loudoun",2500,34000,7.3529411764705888,165,150,155,10,15,"Alan","Brown","Scottish National Party","Hold","Alan","Brown","Scottish National Party",2250,225,"Same MP"]
["London","Kingston and Surbiton",1750,64000,2.734375,195,165,195,0,30,"Edward","Davey","Liberal Democrat","Hold","Edward","Davey","Liberal Democrat",1500,300,"Same MP"]
["Yorkshire & the Humber","Kingston upon Hull East",13000,41000,31.707317073170731,265,255,270,-5,10,"Karl","Turner","Labour","Hold","Karl","Turner","Labour",13000,900,"Same MP"]
["Yorkshire & the Humber","Kingston upon Hull North",1500,23000,6.5217391304347823,95,100,90,5,-5,"Diana R.","Johnson","Labour","Hold","Diana R.","Johnson","Labour",1250,175,"Same MP"]
["Yorkshire & the Humber","Kingston upon Hull West and Hessle",7000,71000,9.8591549295774641,260,275,255,5,-15,"Emma","Hardy","Labour","Hold","Emma","Hardy","Labour",6000,600,"Same MP"]
["South West","Kingswood",1250,25000,5,165,170,170,-5,-5,"Chris","Skidmore","Conservative","Hold","Chris","Skidmore","Conservative",1250,125,"Same MP"]
["Scotland","Kirkcaldy and Cowdenbeath",3500,32000,10.9375,285,120,335,-50,165,"Neale","Hanvey","Independent","Change","Lesley","Laird","Labour",3500,300,"New MP"]
["North West","Knowsley",6000,40000,15,235,220,225,10,15,"George","Howarth","Labour","Hold","George","Howarth","Labour",5000,350,"Same MP"]
["Northern Ireland","Lagan Valley",null,null,{"$error":"#DIV/0!"},285,250,290,-5,35,"Jeffrey M.","Donaldson","DUP","Hold","Jeffrey M.","Donaldson","DUP",null,null,"Same MP"]
["Scotland","Lanark and Hamilton East",4000,44000,9.0909090909090917,165,150,165,0,15,"Angela","Crawley","Scottish National Party","Hold","Angela","Crawley","Scottish National Party",3500,450,"Same MP"]
["North West","Lancaster and Fleetwood",2500,39000,6.4102564102564097,180,155,170,10,25,"Cat","Smith","Labour","Hold","Cat","Smith","Labour",2000,400,"Same MP"]
["Yorkshire & the Humber","Leeds Central",11000,226000,4.8672566371681416,345,315,345,0,30,"Hilary","Benn","Labour","Hold","Hilary","Benn","Labour",10000,800,"Same MP"]
["Yorkshire & the Humber","Leeds East",3500,38000,9.2105263157894726,110,90,120,{"$f":"F329-H329","v":-10},{"$f":"F329-G329","v":20},"Richard","Burgon","Labour","Hold","Richard","Burgon","Labour",3000,200,"Same MP"]
["Yorkshire & the Humber","Leeds North East",300,20000,1.5,65,65,70,-5,0,"Fabian","Hamilton","Labour",{"$f":"IF(M330=Q330, \"Hold\", \"Change\")","v":"Hold"},"Fabian","Hamilton","Labour",250,50,{"$f":"IF(L330=P330, \"Same MP\", \"New MP\")","v":"Same MP"}]
["Yorkshire & the Humber","Leeds North West",1500,28000,{"$f":"(C331/D331)*100","v":5.3571428571428568},110,120,110,0,-10,"Alex","Sobel","Labour/Co-operative","Hold","Alex","Sobel","Labour/Co-operative",1250,125,"Same MP"]
["Yorkshire & the Humber","Leeds West",4000,48000,8.3333333333333321,230,260,240,-10,-30,"Rachel","Reeves","Labour","Hold","Rachel","Reeves","Labour",3500,400,"Same MP"]
["East Midlands","Leicester East",8000,37000,21.621621621621621,585,530,580,5,55,"Claudia","Webbe","Labour","Hold","Keith","Vaz","Labour",7000,1500,"New MP"]
["East Midlands","Leicester South",3500,85000,4.117647058823529,380,345,375,5,35,"Jon","Ashworth","Labour","Change","Jon","Ashworth","Labour/Co-operative",2500,600,"Same MP"]
["East Midlands","Leicester West",8000,42000,19.047619047619047,265,265,270,-5,0,"Liz","Kendall","Labour","Hold","Liz","Kendall","Labour",7000,800,"Same MP"]
["North West","Leigh",3500,33000,10.606060606060606,215,215,215,0,0,"James","Grundy","Conservative","Change","Jo","Platt","Labour/Co-operative",3500,300,"New MP"]
["South East","Lewes",2250,36000,6.25,280,245,265,15,35,"Maria","Caulfield","Conservative","Hold","Maria","Caulfield","Conservative",2250,200,"Same MP"]
["London","Lewisham East",200,25000,0.8,70,65,75,-5,5,"Janet","Daby","Labour","Hold","Janet","Daby","Labour",175,25,"Same MP"]
["London","Lewisham West and Penge",600,23000,2.6086956521739131,140,135,145,-5,5,"Ellie","Reeves","Labour","Hold","Ellie","Reeves","Labour",500,75,"Same MP"]
["London","Lewisham, Deptford",700,31000,2.258064516129032,135,140,140,-5,-5,"Vicky","Foxcroft","Labour","Hold","Vicky","Foxcroft","Labour",600,75,"Same MP"]
["London","Leyton and Wanstead",450,29000,1.5517241379310345,120,105,100,20,15,"John","Cryer","Labour","Hold","John","Cryer","Labour",400,50,"Same MP"]
["West Midlands","Lichfield",6000,43000,13.953488372093023,275,255,270,5,20,"Michael","Fabricant","Conservative","Hold","Michael","Fabricant","Conservative",5000,500,"Same MP"]
["East Midlands","Lincoln",4500,59000,7.6271186440677967,155,170,155,0,-15,"Karl","McCartney","Conservative","Change","Karen","Lee","Labour",4000,350,"New MP"]
["Scotland","Linlithgow and East Falkirk",6000,40000,15,150,135,155,-5,15,"Martyn","Day","Scottish National Party","Hold","Martyn","Day","Scottish National Party",5000,700,"Same MP"]
["North West","Liverpool, Riverside",2500,134000,1.8656716417910446,250,220,240,10,30,"Kim","Johnson","Labour","Change","Louise","Ellman","Labour/Co-operative",2250,250,"New MP"]
["North West","Liverpool, Walton",1750,34000,5.1470588235294112,100,85,95,5,15,"Dan","Carden","Labour","Hold","Dan","Carden","Labour",1750,150,"Same MP"]
["North West","Liverpool, Wavertree",1000,26000,3.8461538461538463,90,50,75,15,40,"Paula","Barker","Labour","Change","Luciana","Berger","Independent",900,100,"New MP"]
["North West","Liverpool, West Derby",75,19000,0.39473684210526316,45,30,40,5,15,"Ian","Byrne","Labour","Change","Stephen","Twigg","Labour/Co-operative",75,15,"New MP"]
["Scotland","Livingston",5000,54000,9.2592592592592595,200,185,190,10,15,"Hannah","Bardell","Scottish National Party","Hold","Hannah","Bardell","Scottish National Party",5000,350,"Same MP"]
["Wales","Llanelli",5000,27000,18.518518518518519,115,100,120,-5,15,"Nia","Griffith","Labour","Hold","Nia","Griffith","Labour",5000,175,"Same MP"]
["East Midlands","Loughborough",6000,44000,13.636363636363635,270,255,340,-70,15,"Jane","Hunt","Conservative","Hold","Nicky","Morgan","Conservative",5000,350,"New MP"]
["East Midlands","Louth and Horncastle",4000,28000,14.285714285714285,215,220,220,-5,-5,"Victoria","Atkins","Conservative","Hold","Victoria","Atkins","Conservative",3500,350,"Same MP"]
["West Midlands","Ludlow",4000,26000,15.384615384615385,300,275,295,5,25,"Philip","Dunne","Conservative","Hold","Philip","Dunne","Conservative",3500,350,"Same MP"]
["Eastern","Luton North",2250,26000,8.6538461538461533,115,105,120,-5,10,"Sarah","Owen","Labour","Change","Kelvin","Hopkins","Independent",2000,200,"New MP"]
["Eastern","Luton South",7000,68000,10.294117647058822,250,215,250,0,35,"Rachel","Hopkins","Labour","Change","Gavin","Shuker","Independent",6000,400,"New MP"]
["North West","Macclesfield",3500,42000,8.3333333333333321,255,235,260,-5,20,"David","Rutley","Conservative","Hold","David","Rutley","Conservative",3000,300,"Same MP"]
["South East","Maidenhead",2250,63000,3.5714285714285712,240,270,250,-10,-30,"Theresa","May","Conservative","Hold","Theresa","May","Conservative",2000,200,"Same MP"]
["South East","Maidstone and The Weald",2250,50000,4.5,225,230,225,0,-5,"Helen","Grant","Conservative","Hold","Helen","Grant","Conservative",2000,175,"Same MP"]
["North West","Makerfield",2000,22000,9.0909090909090917,160,150,160,0,10,"Yvonne","Fovargue","Labour","Hold","Yvonne","Fovargue","Labour",2000,150,"Same MP"]
["Eastern","Maldon",3000,30000,10,330,315,330,0,15,"John","Whittingdale","Conservative","Hold","John","Whittingdale","Conservative",3000,450,"Same MP"]
["North West","Manchester Central",6000,243000,2.4691358024691357,355,320,365,-10,35,"Lucy","Powell","Labour/Co-operative","Hold","Lucy","Powell","Labour/Co-operative",5000,500,"Same MP"]
["North West","Manchester, Gorton",900,22000,4.0909090909090908,75,65,75,0,10,"Afzal","Khan","Labour","Hold","Afzal","Khan","Labour",900,75,"Same MP"]
["North West","Manchester, Withington",500,29000,1.7241379310344827,85,65,95,-10,20,"Jeff","Smith","Labour","Hold","Jeff","Smith","Labour",450,30,"Same MP"]
["East Midlands","Mansfield",4000,40000,10,190,180,200,-10,10,"Ben","Bradley","Conservative","Hold","Ben","Bradley","Conservative",4000,300,"Same MP"]
["South East","Meon Valley",4500,48000,9.375,335,290,320,15,45,"Flick","Drummond","Conservative","Hold","George","Hollingbery","Conservative",4000,350,"New MP"]
["West Midlands","Meriden",2000,65000,3.0769230769230771,170,145,170,0,25,"Saqib","Bhatti","Conservative","Hold","Caroline","Spelman","Conservative",2000,125,"New MP"]
["Wales","Merthyr Tydfil and Rhymney",3500,24000,14.583333333333334,90,80,85,5,10,"Gerald","Jones","Labour","Hold","Gerald","Jones","Labour",3000,250,"Same MP"]
["Eastern","Mid Bedfordshire",2500,39000,6.4102564102564097,260,235,255,5,25,"Nadine","Dorries","Conservative","Hold","Nadine","Dorries","Conservative",2250,250,"Same MP"]
["East Midlands","Mid Derbyshire",1250,22000,5.6818181818181817,135,135,135,0,0,"Pauline","Latham","Conservative","Hold","Pauline","Latham","Conservative",1000,100,"Same MP"]
["South West","Mid Dorset and North Poole",4500,29000,15.517241379310345,270,275,275,-5,-5,"Michael","Tomlinson","Conservative","Hold","Michael","Tomlinson","Conservative",4000,450,"Same MP"]
["Eastern","Mid Norfolk",4000,33000,12.121212121212121,260,250,265,-5,10,"George","Freeman","Conservative","Hold","George","Freeman","Conservative",3500,600,"Same MP"]
["South East","Mid Sussex",3000,45000,6.666666666666667,250,250,260,-10,0,"Mims","Davies","Conservative","Change","Nicholas","Soames","Independent",2500,450,"New MP"]
["Northern Ireland","Mid Ulster",null,null,{"$error":"#DIV/0!"},495,445,475,20,50,"Francie","Molloy","Sinn Fein","Hold","Francie","Molloy","Sinn Fein",null,null,"Same MP"]
["West Midlands","Mid Worcestershire",8000,42000,19.047619047619047,320,290,295,25,30,"Nigel","Huddleston","Conservative","Hold","Nigel","Huddleston","Conservative",7000,600,"Same MP"]
["North East","Middlesbrough",3000,53000,5.6603773584905666,155,125,135,20,30,"Andy","McDonald","Labour","Hold","Andy","McDonald","Labour",2500,350,"Same MP"]
["North East","Middlesbrough South and East Cleveland",1000,16000,6.25,135,105,120,15,30,"Simon","Clarke","Conservative","Hold","Simon","Clarke","Conservative",900,100,"Same MP"]
["Scotland","Midlothian",3000,31000,9.67741935483871,155,125,150,5,30,"Owen","Thompson","Scottish National Party","Change","Danielle","Rowley","Labour",2500,175,"New MP"]
["South East","Milton Keynes North",4500,94000,4.7872340425531918,270,235,275,-5,35,"Ben","Everitt","Conservative","Hold","Mark","Lancaster","Conservative",4000,700,"New MP"]
["South East","Milton Keynes South",6000,88000,6.8181818181818175,265,230,265,0,35,"Iain","Stewart","Conservative","Hold","Iain","Stewart","Conservative",6000,400,"Same MP"]
["London","Mitcham and Morden",1500,21000,7.1428571428571423,165,145,165,0,20,"Siobhain","McDonagh","Labour","Hold","Siobhain","McDonagh","Labour",1250,175,"Same MP"]
["South East","Mole Valley",3000,50000,6,240,250,220,20,-10,"Paul","Beresford","Conservative","Hold","Paul","Beresford","Conservative",2500,225,"Same MP"]
["Wales","Monmouth",3000,34000,8.8235294117647065,195,165,190,5,30,"David","Davies","Conservative","Hold","David","Davies","Conservative",2500,175,"Same MP"]
["Wales","Montgomeryshire",4000,22000,18.181818181818183,190,180,190,0,10,"Craig","Williams","Conservative","Hold","Glyn","Davies","Conservative",4000,250,"New MP"]
["Scotland","Moray",6000,35000,17.142857142857142,185,170,180,5,15,"Douglas","Ross","Conservative","Hold","Douglas","Ross","Conservative",4500,1000,"Same MP"]
["North West","Morecambe and Lunesdale",1500,26000,5.7692307692307692,160,140,145,15,20,"David","Morris","Conservative","Hold","David","Morris","Conservative",1500,125,"Same MP"]
["Yorkshire & the Humber","Morley and Outwood",3500,51000,6.8627450980392162,220,210,235,-15,10,"Andrea","Jenkyns","Conservative","Hold","Andrea","Jenkyns","Conservative",3500,350,"Same MP"]
["Scotland","Motherwell and Wishaw",1750,27000,6.481481481481481,110,95,105,5,15,"Marion","Fellows","Scottish National Party","Hold","Marion","Fellows","Scottish National Party",1500,150,"Same MP"]
["Scotland","Na h-Eileanan An Iar",700,11000,6.3636363636363633,75,65,85,-10,10,"Angus","MacNeil","Scottish National Party","Hold","Angus","MacNeil","Scottish National Party",600,150,"Same MP"]
["Wales","Neath",1500,16000,9.375,110,100,100,10,10,"Christina","Rees","Labour/Co-operative","Hold","Christina","Rees","Labour/Co-operative",1250,75,"Same MP"]
["South East","New Forest East",3500,36000,9.7222222222222232,215,200,215,0,15,"Julian","Lewis","Conservative","Hold","Julian","Lewis","Conservative",3500,225,"Same MP"]
["South East","New Forest West",3000,33000,9.0909090909090917,280,260,270,10,20,"Desmond","Swayne","Conservative","Hold","Desmond","Swayne","Conservative",2500,250,"Same MP"]
["East Midlands","Newark",5000,43000,11.627906976744185,270,245,270,0,25,"Robert","Jenrick","Conservative","Hold","Robert","Jenrick","Conservative",4500,800,"Same MP"]
["South East","Newbury",9000,72000,12.5,320,310,325,{"$f":"F393-H393","v":-5},{"$f":"F393-G393","v":10},"Laura","Farris","Conservative","Change","Richard","Benyon","Independent",9000,500,"New MP"]
["North East","Newcastle upon Tyne Central",1500,98000,1.5306122448979591,105,75,110,-5,30,"Chi","Onwurah","Labour",{"$f":"IF(M394=Q394, \"Hold\", \"Change\")","v":"Hold"},"Chi","Onwurah","Labour",1250,200,{"$f":"IF(L394=P394, \"Same MP\", \"New MP\")","v":"Same MP"}]
["North East","Newcastle upon Tyne East",3500,55000,{"$f":"(C395/D395)*100","v":6.3636363636363633},110,110,105,5,0,"Nick","Brown","Labour","Hold","Nick","Brown","Labour",3500,225,"Same MP"]
["North East","Newcastle upon Tyne North",2250,30000,7.5,115,110,125,-10,5,"Catherine","McKinnell","Labour","Hold","Catherine","McKinnell","Labour",2000,175,"Same MP"]
["West Midlands","Newcastle-under-Lyme",3500,38000,9.2105263157894726,180,170,170,10,10,"Aaron","Bell","Conservative","Change","Paul","Farrelly","Labour",3500,300,"New MP"]
["Wales","Newport East",4500,27000,16.666666666666664,125,105,110,15,20,"Jessica","Morden","Labour","Hold","Jessica","Morden","Labour",4500,175,"Same MP"]
["Wales","Newport West",4000,59000,6.7796610169491522,130,110,125,5,20,"Ruth","Jones","Labour","Hold","Ruth","Jones","Labour",4000,125,"Same MP"]
["Northern Ireland","Newry & Armagh",null,null,{"$error":"#DIV/0!"},345,285,335,10,60,"Mickey","Brady","Sinn Fein","Hold","Mickey","Brady","Sinn Fein",null,null,"Same MP"]
["South West","Newton Abbot",2500,30000,8.3333333333333321,205,190,200,5,15,"Anne Marie","Morris","Conservative","Hold","Anne Marie","Morris","Conservative",2250,225,"Same MP"]
["Yorkshire & the Humber","Normanton, Pontefract and Castleford",10000,54000,18.518518518518519,225,180,225,0,45,"Yvette","Cooper","Labour","Hold","Yvette","Cooper","Labour",9000,500,"Same MP"]
["Northern Ireland","North Antrim",null,null,{"$error":"#DIV/0!"},265,250,265,0,15,"Ian","Paisley Jnr","DUP","Hold","Ian","Paisley Jnr","DUP",null,null,"Same MP"]
["Scotland","North Ayrshire and Arran",2250,23000,9.7826086956521738,155,130,150,5,25,"Patricia","Gibson","Scottish National Party","Hold","Patricia","Gibson","Scottish National Party",2000,225,"Same MP"]
["South West","North Cornwall",3500,35000,10,255,215,230,25,40,"Scott","Mann","Conservative","Hold","Scott","Mann","Conservative",3500,300,"Same MP"]
["South West","North Devon",5000,42000,11.904761904761903,215,210,220,-5,5,"Selaine","Saxby","Conservative","Hold","Peter","Heaton-Jones","Conservative",4500,1000,"New MP"]
["South West","North Dorset",4000,32000,12.5,370,355,350,20,15,"Simon","Hoare","Conservative","Hold","Simon","Hoare","Conservative",3500,400,"Same MP"]
["Northern Ireland","North Down",null,null,{"$error":"#DIV/0!"},125,120,130,-5,5,"Stephen","Farry","Alliance","Change","Sylvia","Hermon","Independent",null,null,"New MP"]
["North East","North Durham",2000,21000,9.5238095238095237,125,110,120,5,15,"Kevan","Jones","Labour","Hold","Kevan","Jones","Labour",1750,200,"Same MP"]
["Eastern","North East Bedfordshire",3000,33000,9.0909090909090917,275,255,270,5,20,"Richard","Fuller","Conservative","Change","Alistair","Burt","Independent",2500,350,"New MP"]
["Eastern","North East Cambridgeshire",7000,38000,18.421052631578945,275,245,275,0,30,"Stephen","Barclay","Conservative","Hold","Stephen","Barclay","Conservative",6000,800,"Same MP"]
["East Midlands","North East Derbyshire",5000,25000,20,220,210,210,10,10,"Lee","Rowley","Conservative","Hold","Lee","Rowley","Conservative",4500,450,"Same MP"]
["Scotland","North East Fife",1250,27000,4.6296296296296298,130,115,125,5,15,"Wendy","Chamberlain","Liberal Democrat","Change","Stephen","Gethins","Scottish National Party",1000,200,"New MP"]
["South East","North East Hampshire",1750,37000,4.7297297297297298,215,220,210,5,-5,"Ranil","Jayawardena","Conservative","Hold","Ranil","Jayawardena","Conservative",1500,150,"Same MP"]
["Eastern","North East Hertfordshire",6000,39000,15.384615384615385,330,330,330,0,0,"Oliver","Heald","Conservative","Hold","Oliver","Heald","Conservative",5000,700,"Same MP"]
["South West","North East Somerset",2250,30000,7.5,215,235,220,-5,-20,"Jacob","Rees-Mogg","Conservative","Hold","Jacob","Rees-Mogg","Conservative",2250,200,"Same MP"]
["West Midlands","North Herefordshire",4000,27000,14.814814814814813,310,310,320,-10,0,"Bill","Wiggin","Conservative","Hold","Bill","Wiggin","Conservative",4000,400,"Same MP"]
["Eastern","North Norfolk",1500,25000,6,180,180,180,0,0,"Duncan Charles","Baker","Conservative","Change","Norman","Lamb","Liberal Democrat",1250,225,"New MP"]
["West Midlands","North Shropshire",5000,38000,13.157894736842104,285,245,285,0,40,"Owen","Paterson","Conservative","Hold","Owen","Paterson","Conservative",4500,450,"Same MP"]
["South West","North Somerset",4000,44000,9.0909090909090917,225,225,235,-10,0,"Liam","Fox","Conservative","Hold","Liam","Fox","Conservative",3500,400,"Same MP"]
["South West","North Swindon",7000,52000,13.461538461538462,185,170,175,10,15,"Justin","Tomlinson","Conservative","Hold","Justin","Tomlinson","Conservative",7000,250,"Same MP"]
["South East","North Thanet",1750,26000,6.7307692307692308,170,130,160,10,40,"Roger","Gale","Conservative","Hold","Roger","Gale","Conservative",1500,125,"Same MP"]
["North East","North Tyneside",4500,42000,10.714285714285714,170,150,165,5,20,"Mary","Glindon","Labour","Hold","Mary","Glindon","Labour",4000,500,"Same MP"]
["West Midlands","North Warwickshire",11000,64000,17.1875,340,335,340,0,5,"Craig","Tracey","Conservative","Hold","Craig","Tracey","Conservative",10000,700,"Same MP"]
["Eastern","North West Cambridgeshire",4000,60000,6.666666666666667,320,305,320,0,15,"Shailesh","Vara","Conservative","Hold","Shailesh","Vara","Conservative",3500,500,"Same MP"]
["North East","North West Durham",4500,22000,20.454545454545457,150,155,165,-15,-5,"Richard","Holden","Conservative","Change","Laura","Pidcock","Labour",4000,600,"New MP"]
["South East","North West Hampshire",5000,42000,11.904761904761903,285,295,295,-10,-10,"Kit","Malthouse","Conservative","Hold","Kit","Malthouse","Conservative",4500,400,"Same MP"]
["East Midlands","North West Leicestershire",8000,61000,13.114754098360656,325,275,310,15,50,"Andrew","Bridgen","Conservative","Hold","Andrew","Bridgen","Conservative",8000,600,"Same MP"]
["Eastern","North West Norfolk",5000,41000,12.195121951219512,215,205,220,-5,10,"James","Wild","Conservative","Hold","Henry","Bellingham","Conservative",4500,450,"New MP"]
["South West","North Wiltshire",2500,35000,7.1428571428571423,240,240,240,0,0,"James","Gray","Conservative","Hold","James","Gray","Conservative",2250,225,"Same MP"]
["East Midlands","Northampton North",5000,35000,14.285714285714285,160,155,160,0,5,"Michael","Ellis","Conservative","Hold","Michael","Ellis","Conservative",5000,300,"Same MP"]
["East Midlands","Northampton South",4000,66000,6.0606060606060606,190,200,195,-5,-10,"Andrew","Lewer","Conservative","Hold","Andrew","Lewer","Conservative",3500,600,"Same MP"]
["Eastern","Norwich North",3500,42000,8.3333333333333321,160,165,170,-10,-5,"Chloe","Smith","Conservative","Hold","Chloe","Smith","Conservative",3000,300,"Same MP"]
["Eastern","Norwich South",2500,75000,3.3333333333333335,135,135,125,10,0,"Clive","Lewis","Labour","Hold","Clive","Lewis","Labour",2000,600,"Same MP"]
["East Midlands","Nottingham East",1500,58000,2.5862068965517242,185,165,190,-5,20,"Nadia","Whittome","Labour","Change","Chris","Leslie","Independent",1250,175,"New MP"]
["East Midlands","Nottingham North",2500,25000,10,235,135,180,55,100,"Alex","Norris","Labour/Co-operative","Hold","Alex","Norris","Labour/Co-operative",2250,250,"Same MP"]
["East Midlands","Nottingham South",5000,112000,4.4642857142857144,220,200,215,5,20,"Lilian","Greenwood","Labour","Hold","Lilian","Greenwood","Labour",4500,500,"Same MP"]
["West Midlands","Nuneaton",2500,32000,7.8125,210,200,215,-5,10,"Marcus","Jones","Conservative","Hold","Marcus","Jones","Conservative",2500,225,"Same MP"]
["Scotland","Ochil and South Perthshire",3500,30000,11.666666666666666,175,165,185,-10,10,"John","Nicolson","Scottish National Party","Change","Luke","Graham","Conservative",3000,250,"New MP"]
["Wales","Ogmore",4000,20000,20,120,110,115,5,10,"Chris","Elmore","Labour","Hold","Chris","Elmore","Labour",4000,225,"Same MP"]
["London","Old Bexley and Sidcup",900,26000,3.4615384615384617,115,100,115,0,15,"James","Brokenshire","Conservative","Hold","James","Brokenshire","Conservative",800,100,"Same MP"]
["North West","Oldham East and Saddleworth",4500,35000,12.857142857142856,260,275,260,0,-15,"Debbie","Abrahams","Labour","Hold","Debbie","Abrahams","Labour",4000,500,"Same MP"]
["North West","Oldham West and Royton",6000,42000,14.285714285714285,245,245,245,0,0,"Jim","McMahon","Labour/Co-operative","Hold","Jim","McMahon","Labour/Co-operative",5000,400,"Same MP"]
["Scotland","Orkney and Shetland",1250,24000,5.2083333333333339,130,105,130,0,25,"Alistair","Carmichael","Liberal Democrat","Hold","Alistair","Carmichael","Liberal Democrat",1000,225,"Same MP"]
["London","Orpington",1000,31000,3.225806451612903,140,135,150,-10,5,"Gareth","Bacon","Conservative","Hold","Jo","Johnson","Conservative",900,100,"New MP"]
["South East","Oxford East",5000,103000,4.8543689320388346,95,75,95,0,20,"Anneliese","Dodds","Labour/Co-operative","Hold","Anneliese","Dodds","Labour/Co-operative",5000,125,"Same MP"]
["South East","Oxford West and Abingdon",2500,53000,4.716981132075472,170,160,165,5,10,"Layla","Moran","Liberal Democrat","Hold","Layla","Moran","Liberal Democrat",2500,200,"Same MP"]
["Scotland","Paisley and Renfrewshire North",8000,58000,13.793103448275861,205,180,190,15,25,"Gavin","Newlands","Scottish National Party","Hold","Gavin","Newlands","Scottish National Party",7000,400,"Same MP"]
["Scotland","Paisley and Renfrewshire South",1000,29000,3.4482758620689653,110,85,110,0,25,"Mhairi","Black","Scottish National Party","Hold","Mhairi","Black","Scottish National Party",900,125,"Same MP"]
["North West","Pendle",10000,33000,30.303030303030305,285,280,290,-5,5,"Andrew","Stephenson","Conservative","Hold","Andrew","Stephenson","Conservative",9000,700,"Same MP"]
["Yorkshire & the Humber","Penistone and Stocksbridge",4500,27000,16.666666666666664,190,180,195,-5,10,"Miriam Joy","Cates","Conservative","Change","Angela","Smith","Independent",4500,250,"New MP"]
["North West","Penrith and The Border",3500,40000,8.75,230,220,235,-5,10,"Neil","Hudson","Conservative","Change","Rory","Stewart","Independent",3500,250,"New MP"]
["Scotland","Perth and North Perthshire",3000,46000,6.5217391304347823,185,165,170,15,20,"Pete","Wishart","Scottish National Party","Hold","Pete","Wishart","Scottish National Party",2500,300,"Same MP"]
["Eastern","Peterborough",6000,73000,8.2191780821917799,195,185,200,-5,10,"Paul","Bristow","Conservative","Change","Lisa","Forbes","Labour",5000,400,"New MP"]
["South West","Plymouth, Moor View",4000,36000,11.111111111111111,100,90,95,5,10,"Johnny","Mercer","Conservative","Hold","Johnny","Mercer","Conservative",3500,300,"Same MP"]
["South West","Plymouth, Sutton and Devonport",7000,57000,12.280701754385964,135,105,125,10,30,"Luke","Pollard","Labour/Co-operative","Hold","Luke","Pollard","Labour/Co-operative",7000,225,"Same MP"]
["Wales","Pontypridd",5000,44000,11.363636363636363,135,125,125,{"$f":"F457-H457","v":10},{"$f":"F457-G457","v":10},"Alex","Davies-Jones","Labour","Hold","Owen","Smith","Labour",5000,225,"New MP"]
["South West","Poole",7000,55000,12.727272727272727,285,280,290,-5,5,"Robert","Syms","Conservative",{"$f":"IF(M458=Q458, \"Hold\", \"Change\")","v":"Hold"},"Robert","Syms","Conservative",6000,350,{"$f":"IF(L458=P458, \"Same MP\", \"New MP\")","v":"Same MP"}]
["London","Poplar and Limehouse",2250,195000,{"$f":"(C459/D459)*100","v":1.153846153846154},170,140,155,15,30,"Apsana","Begum","Labour","Hold","Jim","Fitzpatrick","Labour",1750,500,"New MP"]
["South East","Portsmouth North",6000,60000,10,235,210,245,-10,25,"Penny","Mordaunt","Conservative","Hold","Penny","Mordaunt","Conservative",6000,450,"Same MP"]
["South East","Portsmouth South",2500,46000,5.4347826086956523,110,105,105,5,5,"Stephen","Morgan","Labour","Hold","Stephen","Morgan","Labour",2500,125,"Same MP"]
["Wales","Preseli Pembrokeshire",1250,26000,4.8076923076923084,210,150,195,15,60,"Stephen","Crabb","Conservative","Hold","Stephen","Crabb","Conservative",1250,100,"Same MP"]
["North West","Preston",3500,63000,5.5555555555555554,185,155,180,5,30,"Mark","Hendrick","Labour/Co-operative","Hold","Mark","Hendrick","Labour/Co-operative",3000,350,"Same MP"]
["Yorkshire & the Humber","Pudsey",4000,34000,11.76470588235294,225,220,220,5,5,"Stuart","Andrew","Conservative","Hold","Stuart","Andrew","Conservative",3500,300,"Same MP"]
["London","Putney",250,31000,0.80645161290322576,90,100,95,-5,-10,"Fleur","Anderson","Labour","Change","Justine","Greening","Independent",225,40,"New MP"]
["Eastern","Rayleigh and Wickford",2000,23000,8.695652173913043,295,285,290,5,10,"Mark","Francois","Conservative","Hold","Mark","Francois","Conservative",1750,300,"Same MP"]
["South East","Reading East",1500,86000,1.7441860465116279,150,145,140,10,5,"Matt","Rodda","Labour","Hold","Matt","Rodda","Labour",1250,175,"Same MP"]
["South East","Reading West",1750,53000,3.3018867924528301,125,140,135,-10,-15,"Alok","Sharma","Conservative","Hold","Alok","Sharma","Conservative",1500,150,"Same MP"]
["North East","Redcar",4000,28000,14.285714285714285,155,125,150,5,30,"Jacob","Young","Conservative","Change","Anna","Turley","Labour/Co-operative",3500,400,"New MP"]
["West Midlands","Redditch",9000,41000,21.951219512195124,340,360,335,5,-20,"Rachel","Maclean","Conservative","Hold","Rachel","Maclean","Conservative",8000,700,"Same MP"]
["South East","Reigate",2000,57000,3.5087719298245612,185,175,185,0,10,"Crispin","Blunt","Conservative","Hold","Crispin","Blunt","Conservative",1750,125,"Same MP"]
["Wales","Rhondda",1750,13000,13.461538461538462,90,80,85,5,10,"Chris","Bryant","Labour","Hold","Chris","Bryant","Labour",1750,125,"Same MP"]
["North West","Ribble Valley",12000,59000,20.33898305084746,325,300,320,5,25,"Nigel","Evans","Conservative","Hold","Nigel","Evans","Conservative",11000,600,"Same MP"]
["Yorkshire & the Humber","Richmond (Yorks)",4000,43000,9.3023255813953494,260,230,260,0,30,"Rishi","Sunak","Conservative","Hold","Rishi","Sunak","Conservative",4000,350,"Same MP"]
["London","Richmond Park",600,51000,1.1764705882352942,160,165,175,-15,-5,"Sarah","Olney","Liberal Democrat","Change","Zac","Goldsmith","Conservative",500,100,"New MP"]
["North West","Rochdale",6000,42000,14.285714285714285,310,300,310,0,10,"Tony","Lloyd","Labour","Hold","Tony","Lloyd","Labour",5000,500,"Same MP"]
["South East","Rochester and Strood",4500,54000,8.3333333333333321,265,265,265,0,0,"Kelly","Tolhurst","Conservative","Hold","Kelly","Tolhurst","Conservative",4000,350,"Same MP"]
["Eastern","Rochford and Southend East",4000,44000,9.0909090909090917,250,240,250,0,10,"James","Duddridge","Conservative","Hold","James","Duddridge","Conservative",3500,450,"Same MP"]
["London","Romford",700,40000,1.7500000000000002,160,145,145,15,15,"Andrew","Rosindell","Conservative","Hold","Andrew","Rosindell","Conservative",600,100,"Same MP"]
["South East","Romsey and Southampton North",2500,32000,7.8125,225,175,210,15,50,"Caroline","Nokes","Conservative","Change","Caroline","Nokes","Independent",2250,250,"Same MP"]
["Scotland","Ross, Skye and Lochaber",2000,27000,7.4074074074074066,175,150,180,-5,25,"Ian","Blackford","Scottish National Party","Hold","Ian","Blackford","Scottish National Party",1750,225,"Same MP"]
["North West","Rossendale and Darwen",6000,27000,22.222222222222221,290,285,300,-10,5,"Jake","Berry","Conservative","Hold","Jake","Berry","Conservative",5000,450,"Same MP"]
["Yorkshire & the Humber","Rother Valley",4500,26000,17.307692307692307,205,210,205,0,-5,"Alexander","Stafford","Conservative","Change","Kevin","Barron","Labour",4500,400,"New MP"]
["Yorkshire & the Humber","Rotherham",7000,43000,16.279069767441861,205,210,195,10,-5,"Sarah","Champion","Labour","Hold","Sarah","Champion","Labour",7000,400,"Same MP"]
["West Midlands","Rugby",4000,43000,9.3023255813953494,230,210,230,0,20,"Mark","Pawsey","Conservative","Hold","Mark","Pawsey","Conservative",4000,250,"Same MP"]
["London","Ruislip, Northwood and Pinner",300,32000,0.9375,120,125,125,-5,-5,"David","Simmonds","Conservative","Hold","Nick","Hurd","Conservative",250,40,"New MP"]
["South East","Runnymede and Weybridge",2250,77000,2.9220779220779218,250,240,245,5,10,"Ben","Spencer","Conservative","Change","Philip","Hammond","Independent",2250,150,"New MP"]
["East Midlands","Rushcliffe",2250,37000,6.0810810810810816,195,185,185,10,10,"Ruth","Edwards","Conservative","Change","Kenneth","Clarke","Independent",2000,250,"New MP"]
["Scotland","Rutherglen and Hamilton West",3000,30000,10,170,160,180,-10,10,"Margaret","Ferrier","Scottish National Party","Change","Ged","Killen","Labour/Co-operative",2500,500,"New MP"]
["East Midlands","Rutland and Melton",7000,37000,18.918918918918919,295,270,290,5,25,"Alicia","Kearns","Conservative","Hold","Alan","Duncan","Conservative",6000,700,"New MP"]
["Eastern","Saffron Walden",3000,56000,5.3571428571428568,355,365,350,5,-10,"Kemi","Badenoch","Conservative","Hold","Kemi","Badenoch","Conservative",2500,400,"Same MP"]
["North West","Salford and Eccles",4500,96000,4.6875,205,200,205,0,5,"Rebecca","Long-Bailey","Labour","Hold","Rebecca","Long-Bailey","Labour",4000,300,"Same MP"]
["South West","Salisbury",3000,47000,6.3829787234042552,215,195,215,0,20,"John","Glen","Conservative","Hold","John","Glen","Conservative",2500,300,"Same MP"]
["Yorkshire & the Humber","Scarborough and Whitby",5000,39000,12.820512820512819,190,165,190,0,25,"Robert","Goodwill","Conservative","Hold","Robert","Goodwill","Conservative",4500,400,"Same MP"]
["Yorkshire & the Humber","Scunthorpe",11000,45000,24.444444444444443,165,150,165,0,15,"Holly","Mumby-Croft","Conservative","Change","Nicholas","Dakin","Labour",11000,450,"New MP"]
["North East","Sedgefield",9000,31000,29.032258064516132,195,195,205,-10,0,"Paul","Howell","Conservative","Change","Phil","Wilson","Labour",8000,600,"New MP"]
["North West","Sefton Central",450,21000,2.1428571428571428,100,80,90,10,20,"Bill","Esterson","Labour","Hold","Bill","Esterson","Labour",450,40,"Same MP"]
["Yorkshire & the Humber","Selby and Ainsty",7000,42000,16.666666666666664,285,240,275,10,45,"Nigel","Adams","Conservative","Hold","Nigel","Adams","Conservative",6000,500,"Same MP"]
["South East","Sevenoaks",2250,41000,5.4878048780487809,230,230,225,5,0,"Laura","Trott","Conservative","Hold","Michael","Fallon","Conservative",2000,200,"New MP"]
["Yorkshire & the Humber","Sheffield Central",5000,109000,4.5871559633027523,345,285,355,-10,60,"Paul","Blomfield","Labour","Hold","Paul","Blomfield","Labour",4500,600,"Same MP"]
["Yorkshire & the Humber","Sheffield South East",10000,65000,15.384615384615385,375,265,370,5,110,"Clive","Betts","Labour","Hold","Clive","Betts","Labour",9000,900,"Same MP"]
["Yorkshire & the Humber","Sheffield, Brightside and Hillsborough",5000,35000,14.285714285714285,195,345,225,-30,-150,"Gill","Furniss","Labour","Hold","Gill","Furniss","Labour",4500,600,"Same MP"]
["Yorkshire & the Humber","Sheffield, Hallam",350,18000,1.9444444444444444,90,80,95,-5,10,"Olivia Frances","Blake","Labour","Change","Jared","O'Mara","Independent",350,40,"New MP"]
["Yorkshire & the Humber","Sheffield, Heeley",600,19000,3.1578947368421053,105,90,105,0,15,"Louise","Haigh","Labour","Hold","Louise","Haigh","Labour",600,50,"Same MP"]
["East Midlands","Sherwood",3000,30000,10,250,225,255,-5,25,"Mark","Spencer","Conservative","Hold","Mark","Spencer","Conservative",3000,250,"Same MP"]
["Yorkshire & the Humber","Shipley",3500,30000,11.666666666666666,190,200,195,-5,-10,"Philip","Davies","Conservative","Hold","Philip","Davies","Conservative",3000,300,"Same MP"]
["West Midlands","Shrewsbury and Atcham",3000,51000,5.8823529411764701,225,195,220,5,30,"Daniel","Kawczynski","Conservative","Hold","Daniel","Kawczynski","Conservative",3000,250,"Same MP"]
["South East","Sittingbourne and Sheppey",6000,40000,15,265,230,250,15,35,"Gordon","Henderson","Conservative","Hold","Gordon","Henderson","Conservative",5000,350,"Same MP"]
["Yorkshire & the Humber","Skipton and Ripon",5000,47000,10.638297872340425,315,305,325,-10,10,"Julian","Smith","Conservative","Hold","Julian","Smith","Conservative",4000,500,"Same MP"]
["East Midlands","Sleaford and North Hykeham",6000,42000,14.285714285714285,265,255,270,-5,10,"Caroline","Johnson","Conservative","Hold","Caroline","Johnson","Conservative",6000,350,"Same MP"]
["South East","Slough",4000,73000,5.4794520547945202,235,185,230,5,50,"Tan","Dhesi","Labour","Hold","Tanmanjeet Singh","Dhesi","Labour",4000,350,"Same MP"]
["West Midlands","Solihull",10000,58000,17.241379310344829,130,105,135,-5,25,"Julian","Knight","Conservative","Hold","Julian","Knight","Conservative",10000,150,"Same MP"]
["South West","Somerton and Frome",5000,37000,13.513513513513514,360,375,370,-10,-15,"David","Warburton","Conservative","Hold","David","Warburton","Conservative",5000,450,"Same MP"]
["Northern Ireland","South Antrim",null,null,{"$error":"#DIV/0!"},255,215,250,5,40,"Paul","Girvan","DUP","Hold","Paul","Girvan","DUP",null,null,"Same MP"]
["Eastern","South Basildon and East Thurrock",1500,31000,4.838709677419355,190,195,205,-15,-5,"Stephen","Metcalfe","Conservative","Hold","Stephen","Metcalfe","Conservative",1500,175,"Same MP"]
["Eastern","South Cambridgeshire",5000,71000,7.042253521126761,320,310,330,-10,10,"Anthony","Browne","Conservative","Change","Heidi","Allen","Independent",4500,500,"New MP"]
["East Midlands","South Derbyshire",7000,32000,21.875,255,215,245,10,40,"Heather","Wheeler","Conservative","Hold","Heather","Wheeler","Conservative",7000,300,"Same MP"]
["South West","South Dorset",1500,29000,5.1724137931034484,165,155,160,5,10,"Richard","Drax","Conservative","Hold","Richard","Drax","Conservative",1250,100,"Same MP"]
["Northern Ireland","South Down",null,null,{"$error":"#DIV/0!"},330,305,315,15,25,"Christopher","Hazzard","Sinn Fein","Hold","Christopher","Hazzard","Sinn Fein",null,null,"Same MP"]
["Eastern","South East Cambridgeshire",8000,57000,14.035087719298245,575,310,370,205,265,"Lucy","Frazer","Conservative","Hold","Lucy","Frazer","Conservative",7000,700,"Same MP"]
["South West","South East Cornwall",2500,24000,10.416666666666668,195,170,200,{"$f":"F521-H521","v":-5},{"$f":"F521-G521","v":25},"Sheryll","Murray","Conservative","Hold","Sheryll","Murray","Conservative",2000,250,"Same MP"]
["East Midlands","South Holland and The Deepings",9000,40000,22.5,210,210,215,-5,0,"John","Hayes","Conservative",{"$f":"IF(M522=Q522, \"Hold\", \"Change\")","v":"Hold"},"John","Hayes","Conservative",9000,350,{"$f":"IF(L522=P522, \"Same MP\", \"New MP\")","v":"Same MP"}]
["East Midlands","South Leicestershire",4500,69000,{"$f":"(C523/D523)*100","v":6.5217391304347823},345,325,335,10,20,"Alberto","Costa","Conservative","Hold","Alberto","Costa","Conservative",4000,450,"Same MP"]
["Eastern","South Norfolk",3500,43000,8.1395348837209305,275,240,265,10,35,"Richard","Bacon","Conservative","Hold","Richard","Bacon","Conservative",3000,300,"Same MP"]
["East Midlands","South Northamptonshire",3500,68000,5.1470588235294112,325,310,330,-5,15,"Andrea","Leadsom","Conservative","Hold","Andrea","Leadsom","Conservative",3500,350,"Same MP"]
["North West","South Ribble",3000,29000,10.344827586206897,220,230,225,-5,-10,"Katherine","Fletcher","Conservative","Hold","Seema","Kennedy","Conservative",3000,200,"New MP"]
["North East","South Shields",1500,21000,7.1428571428571423,130,100,130,0,30,"Emma","Lewell-Buck","Labour","Hold","Emma","Lewell-Buck","Labour",1250,300,"Same MP"]
["West Midlands","South Staffordshire",4500,27000,16.666666666666664,230,240,230,0,-10,"Gavin","Williamson","Conservative","Hold","Gavin","Williamson","Conservative",4500,350,"Same MP"]
["Eastern","South Suffolk",5000,32000,15.625,295,290,290,5,5,"James","Cartlidge","Conservative","Hold","James","Cartlidge","Conservative",4500,700,"Same MP"]
["South West","South Swindon",2500,64000,3.90625,130,125,135,-5,5,"Robert","Buckland","Conservative","Hold","Robert","Buckland","Conservative",2500,125,"Same MP"]
["South East","South Thanet",2250,31000,7.2580645161290329,190,170,180,10,20,"Craig","Mackinlay","Conservative","Hold","Craig","Mackinlay","Conservative",2250,200,"Same MP"]
["Eastern","South West Bedfordshire",6000,48000,12.5,310,280,310,0,30,"Andrew","Selous","Conservative","Hold","Andrew","Selous","Conservative",5000,600,"Same MP"]
["South West","South West Devon",5000,32000,15.625,185,180,190,-5,5,"Gary","Streeter","Conservative","Hold","Gary","Streeter","Conservative",5000,250,"Same MP"]
["Eastern","South West Hertfordshire",1750,48000,3.6458333333333335,240,235,240,0,5,"Gagan","Mohindra","Conservative","Change","David","Gauke","Independent",1500,200,"New MP"]
["Eastern","South West Norfolk",6000,34000,17.647058823529413,290,295,290,0,-5,"Elizabeth","Truss","Conservative","Hold","Elizabeth","Truss","Conservative",6000,600,"Same MP"]
["South East","South West Surrey",1500,44000,3.4090909090909087,230,230,230,0,0,"Jeremy","Hunt","Conservative","Hold","Jeremy","Hunt","Conservative",1250,150,"Same MP"]
["South West","South West Wiltshire",5000,45000,11.111111111111111,255,245,240,15,10,"Andrew","Murrison","Conservative","Hold","Andrew","Murrison","Conservative",5000,400,"Same MP"]
["South East","Southampton, Itchen",1750,50000,3.5000000000000004,175,155,235,-60,20,"Royston","Smith","Conservative","Hold","Royston","Smith","Conservative",1750,175,"Same MP"]
["South East","Southampton, Test",1750,60000,2.9166666666666665,175,165,170,5,10,"Alan","Whitehead","Labour","Hold","Alan","Whitehead","Labour",1750,150,"Same MP"]
["Eastern","Southend West",900,28000,3.214285714285714,160,155,165,-5,5,"David","Amess","Conservative","Hold","David","Amess","Conservative",700,125,"Same MP"]
["North West","Southport",1250,31000,4.032258064516129,125,140,125,0,-15,"Damien","Moore","Conservative","Hold","Damien","Moore","Conservative",1250,125,"Same MP"]
["South East","Spelthorne",1500,37000,4.0540540540540544,150,200,155,-5,-50,"Kwasi","Kwarteng","Conservative","Hold","Kwasi","Kwarteng","Conservative",1250,100,"Same MP"]
["Eastern","St Albans",2000,52000,3.8461538461538463,285,180,275,10,105,"Daisy","Cooper","Liberal Democrat","Change","Anne","Main","Conservative",1750,300,"New MP"]
["South West","St Austell and Newquay",2500,37000,6.756756756756757,205,195,205,0,10,"Steve","Double","Conservative","Hold","Steve","Double","Conservative",2250,200,"Same MP"]
["North West","St Helens North",2500,29000,8.6206896551724146,145,160,135,10,-15,"Conor","McGinn","Labour","Hold","Conor","McGinn","Labour",2250,300,"Same MP"]
["North West","St Helens South and Whiston",4000,45000,8.8888888888888893,175,165,175,0,10,"Marie","Rimmer","Labour","Hold","Marie","Rimmer","Labour",4000,400,"Same MP"]
["South West","St Ives",1250,28000,4.4642857142857144,200,170,190,10,30,"Derek","Thomas","Conservative","Hold","Derek","Thomas","Conservative",1000,350,"Same MP"]
["West Midlands","Stafford",5000,48000,10.416666666666668,190,200,195,-5,-10,"Theo","Clarke","Conservative","Hold","Jeremy","Lefroy","Conservative",4500,300,"New MP"]
["West Midlands","Staffordshire Moorlands",4000,24000,16.666666666666664,215,195,210,5,20,"Karen","Bradley","Conservative","Hold","Karen","Bradley","Conservative",3500,450,"Same MP"]
["North West","Stalybridge and Hyde",3000,22000,13.636363636363635,290,275,275,15,15,"Jonathan","Reynolds","Labour/Co-operative","Hold","Jonathan","Reynolds","Labour/Co-operative",3000,300,"Same MP"]
["Eastern","Stevenage",6000,48000,12.5,165,165,175,-10,0,"Stephen","McPartland","Conservative","Hold","Stephen","McPartland","Conservative",5000,350,"Same MP"]
["Scotland","Stirling",2500,46000,5.4347826086956523,150,145,135,15,5,"Alyn","Smith","Scottish National Party","Change","Stephen","Kerr","Conservative",2500,225,"New MP"]
["North West","Stockport",5000,63000,7.9365079365079358,245,240,245,0,5,"Navendu","Mishra","Labour","Change","Ann","Coffey","Independent",4500,400,"New MP"]
["North East","Stockton North",6000,46000,13.043478260869565,165,155,170,-5,10,"Alex","Cunningham","Labour","Hold","Alex","Cunningham","Labour",6000,700,"Same MP"]
["North East","Stockton South",3000,37000,8.1081081081081088,175,160,180,-5,15,"Matt","Vickers","Conservative","Change","Paul","Williams","Labour",2500,450,"New MP"]
["West Midlands","Stoke-on-Trent Central",5000,69000,7.2463768115942031,165,185,170,-5,-20,"Jo","Gideon","Conservative","Change","Gareth","Snell","Labour/Co-operative",4500,600,"New MP"]
["West Midlands","Stoke-on-Trent North",5000,27000,18.518518518518519,245,260,255,-10,-15,"Jonathan Edward","Gullis","Conservative","Change","Ruth","Smeeth","Labour",5000,350,"New MP"]
["West Midlands","Stoke-on-Trent South",5000,29000,17.241379310344829,195,200,200,-5,-5,"Jack Edgar","Brereton","Conservative","Hold","Jack","Brereton","Conservative",5000,350,"Same MP"]
["West Midlands","Stone",4500,26000,17.307692307692307,245,220,240,5,25,"Bill","Cash","Conservative","Hold","Bill","Cash","Conservative",4000,250,"Same MP"]
["West Midlands","Stourbridge",3500,23000,15.217391304347828,300,310,305,-5,-10,"Suzanne","Webb","Conservative","Change","Margot","James","Independent",3000,400,"New MP"]
["Northern Ireland","Strangford",null,null,{"$error":"#DIV/0!"},250,230,245,5,20,"Jim","Shannon","DUP","Hold","Jim","Shannon","DUP",null,null,"Same MP"]
["West Midlands","Stratford-on-Avon",3000,46000,6.5217391304347823,330,300,320,10,30,"Nadhim","Zahawi","Conservative","Hold","Nadhim","Zahawi","Conservative",2500,300,"Same MP"]
["London","Streatham",200,25000,0.8,75,85,85,-10,-10,"Bell","Ribeiro-Addy","Labour","Change","Chuka","Umunna","Liberal Democrat",175,30,"New MP"]
["North West","Stretford and Urmston",7000,90000,7.7777777777777777,215,215,200,15,0,"Kate","Green","Labour","Hold","Kate","Green","Labour",7000,400,"Same MP"]
["South West","Stroud",8000,44000,18.181818181818183,340,350,355,-15,-10,"Siobhan","Baillie","Conservative","Change","David","Drew","Labour/Co-operative",7000,450,"New MP"]
["Eastern","Suffolk Coastal",4000,47000,8.5106382978723403,220,220,215,5,0,"Therese","Coffey","Conservative","Hold","Therese","Coffey","Conservative",3500,400,"Same MP"]
["North East","Sunderland Central",3500,49000,7.1428571428571423,145,140,155,-10,5,"Julie","Elliott","Labour","Hold","Julie","Elliott","Labour",3000,300,"Same MP"]
["South East","Surrey Heath",4000,60000,6.666666666666667,230,250,230,0,-20,"Michael","Gove","Conservative","Hold","Michael","Gove","Conservative",3500,300,"Same MP"]
["London","Sutton and Cheam",600,35000,1.7142857142857144,115,115,120,-5,0,"Paul","Scully","Conservative","Hold","Paul","Scully","Conservative",500,50,"Same MP"]
["West Midlands","Sutton Coldfield",1500,38000,3.9473684210526314,155,145,155,0,10,"Andrew","Mitchell","Conservative","Hold","Andrew","Mitchell","Conservative",1250,100,"Same MP"]
["Wales","Swansea East",2500,47000,5.3191489361702127,125,105,120,5,20,"Carolyn","Harris","Labour","Hold","Carolyn","Harris","Labour",2500,100,"Same MP"]
["Wales","Swansea West",1250,44000,2.8409090909090908,110,105,115,-5,5,"Geraint","Davies","Labour","Change","Geraint","Davies","Labour/Co-operative",1000,75,"Same MP"]
["West Midlands","Tamworth",5000,38000,13.157894736842104,295,295,290,5,0,"Christopher","Pincher","Conservative","Hold","Christopher","Pincher","Conservative",5000,600,"Same MP"]
["North West","Tatton",4000,65000,6.1538461538461542,210,205,215,-5,5,"Esther","McVey","Conservative","Hold","Esther","McVey","Conservative",4000,300,"Same MP"]
["South West","Taunton Deane",3500,56000,6.25,245,205,240,5,40,"Rebecca","Pow","Conservative","Hold","Rebecca","Pow","Conservative",3000,350,"Same MP"]
["West Midlands","Telford",10000,54000,18.518518518518519,300,290,300,0,10,"Lucy","Allan","Conservative","Hold","Lucy","Allan","Conservative",10000,700,"Same MP"]
["South West","Tewkesbury",11000,54000,20.37037037037037,295,300,285,10,-5,"Laurence","Robertson","Conservative","Hold","Laurence","Robertson","Conservative",11000,500,"Same MP"]
["South West","The Cotswolds",5000,48000,10.416666666666668,350,325,345,5,25,"Geoffrey","Clifton-Brown","Conservative","Hold","Geoffrey","Clifton-Brown","Conservative",4500,500,"Same MP"]
["West Midlands","The Wrekin",4500,36000,12.5,150,140,150,0,10,"Mark","Pritchard","Conservative","Hold","Mark","Pritchard","Conservative",4500,175,"Same MP"]
["Yorkshire & the Humber","Thirsk and Malton",8000,39000,20.512820512820511,380,335,370,10,45,"Kevin","Hollinrake","Conservative","Hold","Kevin","Hollinrake","Conservative",7000,600,"Same MP"]
["South West","Thornbury and Yate",3000,38000,7.8947368421052628,245,240,250,-5,5,"Luke","Hall","Conservative","Hold","Luke","Hall","Conservative",3000,250,"Same MP"]
["Eastern","Thurrock",2500,57000,4.3859649122807012,195,155,190,5,40,"Jackie","Doyle-Price","Conservative","Hold","Jackie","Doyle-Price","Conservative",2250,250,"Same MP"]
["South West","Tiverton and Honiton",4500,33000,13.636363636363635,335,290,325,10,45,"Neil","Parish","Conservative","Hold","Neil","Parish","Conservative",4000,450,"Same MP"]
["South East","Tonbridge and Malling",2500,43000,5.8139534883720927,255,255,255,0,0,"Thomas","Tugendhat","Conservative","Hold","Thomas","Tugendhat","Conservative",2500,250,"Same MP"]
["London","Tooting",450,41000,1.097560975609756,130,130,130,{"$f":"F585-H585","v":0},{"$f":"F585-G585","v":0},"Rosena","Allin-Khan","Labour","Hold","Rosena","Allin-Khan","Labour",400,75,"Same MP"]
["South West","Torbay",600,36000,1.6666666666666667,120,100,115,5,20,"Kevin","Foster","Conservative",{"$f":"IF(M586=Q586, \"Hold\", \"Change\")","v":"Hold"},"Kevin","Foster","Conservative",500,75,{"$f":"IF(L586=P586, \"Same MP\", \"New MP\")","v":"Same MP"}]
["Wales","Torfaen",6000,31000,{"$f":"(C587/D587)*100","v":19.35483870967742},195,175,195,0,20,"Nick","Thomas-Symonds","Labour","Hold","Nick","Thomas-Symonds","Labour",6000,500,"Same MP"]
["South West","Torridge and West Devon",2500,28000,8.9285714285714288,215,225,230,-15,-10,"Geoffrey","Cox","Conservative","Hold","Geoffrey","Cox","Conservative",2500,300,"Same MP"]
["South West","Totnes",2250,30000,7.5,270,250,255,15,20,"Anthony","Mangnall","Conservative","Change","Sarah","Wollaston","Liberal Democrat",2000,300,"New MP"]
["London","Tottenham",2500,32000,7.8125,295,250,275,20,45,"David","Lammy","Labour","Hold","David","Lammy","Labour",2000,450,"Same MP"]
["South West","Truro and Falmouth",2500,56000,4.4642857142857144,220,185,220,0,35,"Cherilyn","Mackrory","Conservative","Hold","Sarah","Newton","Conservative",2250,250,"New MP"]
["South East","Tunbridge Wells",2000,46000,4.3478260869565215,225,195,210,15,30,"Greg","Clark","Conservative","Change","Greg","Clark","Independent",1750,175,"Same MP"]
["London","Twickenham",600,45000,1.3333333333333335,185,180,175,10,5,"Munira","Wilson","Liberal Democrat","Hold","Vincent","Cable","Liberal Democrat",500,50,"New MP"]
["North East","Tynemouth",3000,44000,6.8181818181818175,195,165,195,0,30,"Alan","Campbell","Labour","Hold","Alan","Campbell","Labour",3000,300,"Same MP"]
["Northern Ireland","Upper Bann",null,null,{"$error":"#DIV/0!"},275,240,260,15,35,"Carla","Lockhart","DUP","Hold","David","Simpson","DUP",null,null,"New MP"]
["London","Uxbridge and South Ruislip",5000,68000,7.3529411764705888,190,190,200,-10,0,"Boris","Johnson","Conservative","Hold","Boris","Johnson","Conservative",4500,500,"Same MP"]
["Wales","Vale of Clwyd",2250,31000,7.2580645161290329,135,125,135,0,10,"James","Davies","Conservative","Change","Chris","Ruane","Labour",2250,100,"New MP"]
["Wales","Vale of Glamorgan",3000,29000,10.344827586206897,190,180,185,5,10,"Alun","Cairns","Conservative","Hold","Alun","Cairns","Conservative",3000,75,"Same MP"]
["London","Vauxhall",600,104000,0.57692307692307698,135,105,125,10,30,"Florence","Eshalomi","Labour/Co-operative","Change","Kate","Hoey","Labour",500,50,"New MP"]
["Yorkshire & the Humber","Wakefield",6000,57000,10.526315789473683,295,270,290,5,25,"Imran Nasir Ahmad","Khan","Conservative","Change","Mary","Creagh","Labour",5000,500,"New MP"]
["North West","Wallasey",2000,19000,10.526315789473683,135,110,135,0,25,"Angela","Eagle","Labour","Hold","Angela","Eagle","Labour",1750,300,"Same MP"]
["West Midlands","Walsall North",4500,34000,13.23529411764706,290,315,300,-10,-25,"Eddie","Hughes","Conservative","Hold","Eddie","Hughes","Conservative",3500,600,"Same MP"]
["West Midlands","Walsall South",4500,50000,9,250,245,250,0,5,"Valerie","Vaz","Labour","Hold","Valerie","Vaz","Labour",4000,500,"Same MP"]
["London","Walthamstow",1750,28000,6.25,195,180,200,-5,15,"Stella","Creasy","Labour/Co-operative","Hold","Stella","Creasy","Labour/Co-operative",1750,225,"Same MP"]
["North East","Wansbeck",2250,25000,9,120,110,115,5,10,"Ian","Lavery","Labour","Hold","Ian","Lavery","Labour",2000,300,"Same MP"]
["South East","Wantage",3500,55000,6.3636363636363633,270,230,280,-10,40,"David","Johnston","Conservative","Change","Ed","Vaizey","Independent",3000,300,"New MP"]
["West Midlands","Warley",4000,28000,14.285714285714285,195,200,185,10,-5,"John","Spellar","Labour","Hold","John","Spellar","Labour",4000,300,"Same MP"]
["North West","Warrington North",4500,61000,7.3770491803278686,225,220,220,5,5,"Charlotte","Nichols","Labour","Hold","Helen","Jones","Labour",4500,400,"New MP"]
["North West","Warrington South",3000,74000,4.0540540540540544,250,170,240,10,80,"Andy","Carter","Conservative","Change","Faisal","Rashid","Labour",2500,175,"New MP"]
["West Midlands","Warwick and Leamington",4500,66000,6.8181818181818175,290,210,265,25,80,"Matt","Western","Labour","Hold","Matt","Western","Labour",4000,350,"Same MP"]
["North East","Washington and Sunderland West",16000,45000,35.555555555555557,195,175,195,0,20,"Sharon","Hodgson","Labour","Hold","Sharon","Hodgson","Labour",16000,600,"Same MP"]
["Eastern","Watford",2250,111000,2.0270270270270272,220,215,225,-5,5,"Dean","Russell","Conservative","Change","Richard","Harrington","Independent",2000,250,"New MP"]
["Eastern","Waveney",5000,34000,14.705882352941178,210,205,205,5,5,"Peter","Aldous","Conservative","Hold","Peter","Aldous","Conservative",4500,450,"Same MP"]
["South East","Wealden",3000,36000,8.3333333333333321,330,325,345,-15,5,"Nusrat","Ghani","Conservative","Hold","Nusrat","Ghani","Conservative",2500,250,"Same MP"]
["North West","Weaver Vale",5000,49000,10.204081632653061,180,175,170,10,5,"Mike","Amesbury","Labour","Hold","Mike","Amesbury","Labour",5000,350,"Same MP"]
["East Midlands","Wellingborough",7000,45000,15.555555555555555,330,335,335,-5,-5,"Peter","Bone","Conservative","Hold","Peter","Bone","Conservative",6000,600,"Same MP"]
["South West","Wells",4500,45000,10,295,320,310,-15,-25,"James","Heappey","Conservative","Hold","James","Heappey","Conservative",4000,600,"Same MP"]
["Eastern","Welwyn Hatfield",3500,91000,3.8461538461538463,225,205,230,-5,20,"Grant","Shapps","Conservative","Hold","Grant","Shapps","Conservative",3000,400,"Same MP"]
["Yorkshire & the Humber","Wentworth and Dearne",4000,36000,11.111111111111111,195,195,200,-5,0,"John","Healey","Labour","Hold","John","Healey","Labour",4000,300,"Same MP"]
["Scotland","West Aberdeenshire and Kincardine",3500,41000,8.536585365853659,250,195,240,10,55,"Andrew","Bowie","Conservative","Hold","Andrew","Bowie","Conservative",3500,250,"Same MP"]
["West Midlands","West Bromwich East",5000,37000,13.513513513513514,210,190,220,-10,20,"Nicola Faye","Richards","Conservative","Change","Tom","Watson","Labour",4500,400,"New MP"]
["West Midlands","West Bromwich West",9000,51000,17.647058823529413,335,305,335,0,30,"Shaun Stephen","Bailey","Conservative","Change","Adrian","Bailey","Labour/Co-operative",9000,800,"Same MP"]
["South West","West Dorset",4500,51000,8.8235294117647065,305,300,295,10,5,"Chris","Loder","Conservative","Change","Oliver","Letwin","Independent",4000,400,"New MP"]
["Scotland","West Dunbartonshire",2500,31000,8.064516129032258,135,110,135,0,25,"Martin","Docherty","Scottish National Party","Hold","Martin","Docherty","Scottish National Party",2250,150,"Same MP"]
["London","West Ham",2000,74000,2.7027027027027026,180,125,165,15,55,"Lyn","Brown","Labour","Hold","Lyn","Brown","Labour",2000,125,"Same MP"]
["North West","West Lancashire",7000,44000,15.909090909090908,260,230,250,10,30,"Rosie","Cooper","Labour","Hold","Rosie","Cooper","Labour",7000,600,"Same MP"]
["Eastern","West Suffolk",6000,42000,14.285714285714285,325,335,340,-15,-10,"Matthew","Hancock","Conservative","Hold","Matthew","Hancock","Conservative",6000,600,"Same MP"]
["Northern Ireland","West Tyrone",null,null,{"$error":"#DIV/0!"},285,250,265,20,35,"Ã“rfhlaith","Begley","Sinn Fein","Hold","Ã“rfhlaith","Begley","Sinn Fein",null,null,"Same MP"]
["West Midlands","West Worcestershire",5000,34000,14.705882352941178,370,355,365,5,15,"Harriett","Baldwin","Conservative","Hold","Harriett","Baldwin","Conservative",4500,500,"Same MP"]
["London","Westminster North",350,41000,0.85365853658536595,125,105,110,15,20,"Karen","Buck","Labour","Hold","Karen","Buck","Labour",250,75,"Same MP"]
["North West","Westmorland and Lonsdale",3500,44000,7.9545454545454541,280,255,275,5,25,"Tim","Farron","Liberal Democrat","Hold","Tim","Farron","Liberal Democrat",3000,225,"Same MP"]
["South West","Weston-Super-Mare",2500,43000,5.8139534883720927,195,185,190,5,10,"John","Penrose","Conservative","Hold","John","Penrose","Conservative",2250,200,"Same MP"]
["North West","Wigan",6000,47000,12.76595744680851,220,200,220,0,20,"Lisa","Nandy","Labour","Hold","Lisa","Nandy","Labour",5000,300,"Same MP"]
["London","Wimbledon",1000,61000,1.639344262295082,170,170,165,5,0,"Stephen","Hammond","Conservative","Change","Stephen","Hammond","Independent",900,125,"Same MP"]
["South East","Winchester",2500,62000,4.032258064516129,210,190,200,10,20,"Steve","Brine","Conservative","Change","Steve","Brine","Independent",2500,250,"Same MP"]
["South East","Windsor",1500,63000,2.3809523809523809,215,200,210,5,15,"Adam","Afriyie","Conservative","Hold","Adam","Afriyie","Conservative",1500,125,"Same MP"]
["North West","Wirral South",3000,29000,10.344827586206897,110,105,115,-5,5,"Alison","McGovern","Labour","Hold","Alison","McGovern","Labour",3000,125,"Same MP"]
["North West","Wirral West",300,19000,1.5789473684210527,85,85,90,-5,0,"Margaret","Greenwood","Labour","Hold","Margaret","Greenwood","Labour",250,40,"Same MP"]
["Eastern","Witham",4500,36000,12.5,245,245,260,-15,0,"Priti","Patel","Conservative","Hold","Priti","Patel","Conservative",4000,600,"Same MP"]
["South East","Witney",5000,45000,11.111111111111111,255,275,260,-5,-20,"Robert Alexander","Courts","Conservative","Hold","Robert","Courts","Conservative",4500,700,"Same MP"]
["South East","Woking",4500,49000,9.183673469387756,210,185,215,-5,25,"Jonathan","Lord","Conservative","Hold","Jonathan","Lord","Conservative",4500,200,"Same MP"]
["South East","Wokingham",3000,55000,5.4545454545454541,195,190,180,15,5,"John","Redwood","Conservative","Hold","John","Redwood","Conservative",3000,350,"Same MP"]
["West Midlands","Wolverhampton North East",5000,42000,11.904761904761903,165,180,170,-5,-15,"Jane","Stevenson","Conservative","Change","Emma","Reynolds","Labour",4500,500,"New MP"]
["West Midlands","Wolverhampton South East",7000,30000,23.333333333333332,320,340,325,-5,-20,"Pat","McFadden","Labour","Hold","Pat","McFadden","Labour",6000,600,"Same MP"]
["West Midlands","Wolverhampton South West",1750,33000,5.3030303030303028,115,115,145,-30,0,"Stuart Paul","Anderson","Conservative","Change","Eleanor","Smith","Labour",1750,150,"New MP"]
["West Midlands","Worcester",5000,54000,9.2592592592592595,160,170,170,-10,-10,"Robin","Walker","Conservative","Hold","Robin","Walker","Conservative",4500,300,"Same MP"]
["North West","Workington",3500,28000,12.5,180,135,175,5,45,"Mark","Jenkinson","Conservative","Change","Sue","Hayman","Labour",3000,250,"New MP"]
["North West","Worsley and Eccles South",2250,28000,8.0357142857142865,170,160,165,5,10,"Barbara","Keeley","Labour","Hold","Barbara","Keeley","Labour",2000,200,"Same MP"]
["South East","Worthing West",1250,43000,2.9069767441860463,155,135,150,{"$f":"F649-H649","v":5},{"$f":"F649-G649","v":20},"Peter","Bottomley","Conservative","Hold","Peter","Bottomley","Conservative",1250,125,"Same MP"]
["Wales","Wrexham",9000,43000,20.930232558139537,200,175,190,10,25,"Sarah","Atherton","Conservative",{"$f":"IF(M650=Q650, \"Hold\", \"Change\")","v":"Change"},"Ian","Lucas","Labour",8000,300,{"$f":"IF(L650=P650, \"Same MP\", \"New MP\")","v":"New MP"}]
["South East","Wycombe",4500,56000,{"$f":"(C651/D651)*100","v":8.0357142857142865},340,315,335,5,25,"Steven","Baker","Conservative","Hold","Steven","Baker","Conservative",4500,400,"Same MP"]
["North West","Wyre and Preston North",1750,38000,4.6052631578947363,220,190,210,10,30,"Ben","Wallace","Conservative","Hold","Ben","Wallace","Conservative",1500,150,"Same MP"]
["West Midlands","Wyre Forest",4000,32000,12.5,255,245,250,5,10,"Mark","Garnier","Conservative","Hold","Mark","Garnier","Conservative",3500,700,"Same MP"]
["North West","Wythenshawe and Sale East",3500,74000,4.7297297297297298,110,110,110,0,0,"Mike","Kane","Labour","Hold","Mike","Kane","Labour",3000,250,"Same MP"]
["South West","Yeovil",9000,48000,18.75,295,265,275,20,30,"Marcus","Fysh","Conservative","Hold","Marcus","Fysh","Conservative",9000,500,"Same MP"]
["Wales","Ynys Mon",2250,21000,10.714285714285714,115,95,115,0,20,"Virginia","Crosbie","Conservative","Change","Albert","Owen","Labour",2250,125,"New MP"]
["Yorkshire & the Humber","York Central",800,57000,1.4035087719298245,105,95,105,0,10,"Rachael","Maskell","Labour/Co-operative","Hold","Rachael","Maskell","Labour/Co-operative",700,100,"Same MP"]
["Yorkshire & the Humber","York Outer",4000,48000,8.3333333333333321,190,180,195,-5,10,"Julian","Sturdy","Conservative","Hold","Julian","Sturdy","Conservative",3500,300,"Same MP"]
[null,"Column Total",{"$f":"SUM(C9:C658)","v":2395275},29583000,8.0967954568502183,137360,126355,136105,1255,11005]
[]
[null,"East Midlands"]
[null,"Eastern"]
[null,"London"]
[null,"North East"]
[null,"North West"]
[null,"Scotland"]
[null,"Soth East"]
[null,"South West"]
[null,"Wales"]
[null,"West Midlands"]
[null,"Yorkshire & the Humber"]