{"text_format":"1","workbook":"xlsx","n_sheets":6,"sheets":["Dashboard","Data","Mfg Jobs By Party and Region","Cons Above average mfg","2022emp","redundant Data"],"not_rendered":{"charts":0,"images":2,"macros":1,"external_links":0,"defined_names":2,"comments":3,"pivot_tables":1},"unopened":[],"bounds":{"document_bytes":16777216,"sheet_cells":100000,"rows_first":2000,"rows_last":500,"rows_between":2000,"halvings":0,"cell_chars":16384,"cell_head_chars":4096},"cells_cut":0,"cells_raw":0,"read":"whole","date_system":"1900"}

{"sheet":"Dashboard","index":0,"n_rows":12,"n_cols":8,"rows_kept":12,"cut":false,"hidden":false,"merged":[]}
[]
[]
[]
[]
[]
[null,"Enter the Constituency you want Manufacturing statistics for below         (Type or select from drop-down)","Employees in the manufacturing sector in this constituency","Total employees in the constituency","Constituency's dependance on manufacturing (% Mfg jobs)","Number of manufacturing businesses  in this constituency","Who is the Member of Parliament for this constituency?","Party"]
[null,"Richmond (Yorks)",{"$f":"VLOOKUP(B7,Data!B9:AE658,27,FALSE)","v":4000},{"$f":"VLOOKUP(B7,Data!B9:AE658,28,FALSE)","v":43000},{"$f":"VLOOKUP(B7,Data!B9:AH658,33,FALSE) & \" (\" &VLOOKUP(B7,Data!B9:AI658,34,FALSE)&\"%)\"","v":"Manufacturing Dependent (9.3%)"},{"$f":"VLOOKUP(B7,Data!B9:AA658,26,FALSE)","v":260},{"$f":"((VLOOKUP(B7,Data!B9:N658,10,FALSE)) & \" \" &  (VLOOKUP(B7,Data!B9:N658,11,FALSE)))","v":"Rishi Sunak"},{"$f":"VLOOKUP(B7,Data!B9:N658,12,FALSE)","v":"Conservative"}]
[]
[]
[]
[null,null,"How many manufacturing businesses has this constituency gained (or lost) in the past 5 years?","Did the Party hold or change in the December 2019 GE?","Full-Time Employees in this constituency's Manufacturing Sector","Part-Time employees in this constituency's Manufacturing Sector"]
[null,null,{"$f":"VLOOKUP(B7,Data!B9:AF658,31,FALSE)","v":0},{"$f":"VLOOKUP(B7,Data!B9:N658,13,FALSE) & \",\" & \" \" &  \" \" & (VLOOKUP(B7,Data!B9:T658,19,FALSE)) & \" \"","v":"Hold,  Same MP "},{"$f":"VLOOKUP(B7,Data!B9:AE658,29,FALSE)","v":3500},{"$f":"VLOOKUP(B7,Data!B9:AE658,30,FALSE)","v":600},null,"N.B All numbers are rounded according to ONS convention, as such, component parts may not always sum perfectly."]

{"sheet":"Data","index":1,"n_rows":692,"n_cols":35,"rows_kept":692,"cut":false,"hidden":true,"merged":[[6,10,6,12],[6,14,6,16]]}
["JB Manufacturing Constituency Tool"]
["Sources: ONS, Theyworkforyou, Parliament",null,"Use the filters below to extract data to requirements. E.g. You could find newly elected MPs in constituencies in the North East which are manufacturing dependent who held conservative in the 2019 GE"]
[]
[]
[null,null,null,null,"Yellow: Above average",null,null,null,null,null,null,null,null,null,null,null,null,null,null,null,null,null,null,null,null,null,null,null,null,null,null,null,"Yellow: Above average"]
[null,null,"Data missing (NI)",null,"Orange: Above 2x the average",null,null,null,null,null,null,null,null,null,null,null,null,null,null,null,null,null,null,null,null,null,null,null,null,null,null,null,"Orange: Above 2x the average"]
[null,null,null,null,"Red: Above 3x the average",null,null,null,null,null,"MPs 10/04/2024",null,null,null,"Post December 2019 MPs",null,null,"Full-time Mfg employees","Part-time Mfg employees",null,null,null,null,null,null,null,null,null,null,null,null,null,"Red: Above 3x the average"]
["Region","parliamentary constituency 2010","Mfg Employee count 2020","Total Constit Employee count 2018","MFG job percent of total (Yellow higher than average :manufacturing dependent)","2021 Mfg Business count","2018 Mfg Business count","2019 Mfg Business count","2-Year Change Business Count","3-Year Change Business Count","First name","Last name","Party","Hold or Change","First name","Last name","Party","number","number","New or Same MP?","MP name Conc","Full time emp UNADJ FOR NI","Dependent string",null,null,null,"2023 Mfg Business count","2022 Mfg Employee Count","2022 Total Employee count","2022  Mfg FT Employees","2022 Mfg PT Employees","5  Year Mfg Business count change","2022 Dependency","Dependent String 2022","2022 Dependency Rounded"]
["Wales","Aberavon",8000,34000,{"$f":"(C9/D9)*100","v":23.52941176470588},115,105,110,{"$f":"F9-H9","v":5},{"$f":"F9-G9","v":10},"Stephen","Kinnock","Labour",{"$f":"IF(M9=Q9, \"Hold\", \"Change\")","v":"Hold"},"Stephen","Kinnock","Labour",7000,350,{"$f":"IF(L9=P9, \"Same MP\", \"New MP\")","v":"Same MP"},{"$f":"CONCATENATE(K9,\" \",L9)","v":"Stephen Kinnock"},null,{"$f":"IF(E9>24.29, \"Extremely Manufacturing Dependent\", IF(E9>16.59, \"Very Manufacturing Dependent\", IF(E9>8.09, \"Manufacturing Dependent\", \"Not Manufacturing Dependent\")))","v":"Very Manufacturing Dependent"},25.806451612903224,{"$f":"ROUND(X9,1)","v":25.8},25.8,115,{"$f":"VLOOKUP(B9,'2022emp'!$A$2:$B$633,2,FALSE)","v":7000},{"$f":"VLOOKUP(B9,'2022emp'!$A$2:$F$633,4,FALSE)","v":34000},{"$f":"VLOOKUP(B9,'2022emp'!$A$2:$H$633,7,FALSE)","v":7000},{"$f":"VLOOKUP(B9,'2022emp'!$A$2:$H$633,8,FALSE)","v":350},{"$f":"AA9-G9","v":10},{"$f":"(AB9/AC9)*100","v":20.588235294117645},{"$f":"IF(AG9>26.79, \"Extremely Manufacturing Dependent\", IF(AG9>17.86, \"Very Manufacturing Dependent\", IF(AG9>8.93, \"Manufacturing Dependent\", \"Not Manufacturing Dependent\")))","v":"Very Manufacturing Dependent"},{"$f":"ROUND(AG9,1)","v":20.6}]
["Wales","Aberconwy",600,23000,{"$f":"(C10/D10)*100","v":2.6086956521739131},110,100,105,5,10,"Robin","Millar","Conservative",{"$f":"IF(M10=Q10, \"Hold\", \"Change\")","v":"Hold"},"Robin John","Millar","Conservative",500,75,{"$f":"IF(L10=P10, \"Same MP\", \"New MP\")","v":"Same MP"},"Robin Millar",null,"Not Manufacturing Dependent",2.2222222222222223,{"$f":"ROUND(X10,1)","v":2.2000000000000002},2.2000000000000002,95,{"$f":"VLOOKUP(B10,'2022emp'!$A$2:$B$633,2,FALSE)","v":600},{"$f":"VLOOKUP(B10,'2022emp'!$A$2:$F$633,4,FALSE)","v":22000},{"$f":"VLOOKUP(B10,'2022emp'!$A$2:$H$633,7,FALSE)","v":500},{"$f":"VLOOKUP(B10,'2022emp'!$A$2:$H$633,8,FALSE)","v":75},{"$f":"AA10-G10","v":-5},{"$f":"(AB10/AC10)*100","v":2.7272727272727271},{"$f":"IF(AG10>26.79, \"Extremely Manufacturing Dependent\", IF(AG10>17.86, \"Very Manufacturing Dependent\", IF(AG10>8.93, \"Manufacturing Dependent\", \"Not Manufacturing Dependent\")))","v":"Not Manufacturing Dependent"},{"$f":"ROUND(AG10,1)","v":2.7}]
["Scotland","Aberdeen North",1250,71000,{"$f":"(C11/D11)*100","v":1.7605633802816902},95,100,100,-5,-5,"Kirsty","Blackman","Scottish National Party","Hold","Kirsty","Blackman","Scottish National Party",1250,75,{"$f":"IF(L11=P11, \"Same MP\", \"New MP\")","v":"Same MP"},"Kirsty Blackman",null,"Not Manufacturing Dependent",1.3333333333333335,1.3,1.3,90,{"$f":"VLOOKUP(B11,'2022emp'!$A$2:$B$633,2,FALSE)","v":700},{"$f":"VLOOKUP(B11,'2022emp'!$A$2:$F$633,4,FALSE)","v":69000},{"$f":"VLOOKUP(B11,'2022emp'!$A$2:$H$633,7,FALSE)","v":600},{"$f":"VLOOKUP(B11,'2022emp'!$A$2:$H$633,8,FALSE)","v":75},-10,1.0144927536231882,"Not Manufacturing Dependent",1]
["Scotland","Aberdeen South",3500,56000,6.25,200,205,195,5,-5,"Stephen","Flynn","Scottish National Party","Hold","Stephen","Flynn","Scottish National Party",3000,350,"Same MP","Stephen Flynn",null,"Not Manufacturing Dependent",4.918032786885246,4.9000000000000004,4.9000000000000004,190,{"$f":"VLOOKUP(B12,'2022emp'!$A$2:$B$633,2,FALSE)","v":3000},{"$f":"VLOOKUP(B12,'2022emp'!$A$2:$F$633,4,FALSE)","v":56000},{"$f":"VLOOKUP(B12,'2022emp'!$A$2:$H$633,7,FALSE)","v":2500},{"$f":"VLOOKUP(B12,'2022emp'!$A$2:$H$633,8,FALSE)","v":350},-15,5.3571428571428568,"Not Manufacturing Dependent",5.4]
["Scotland","Airdrie and Shotts",2250,30000,7.5,150,145,145,5,5,"Anum","Qaisar","Scottish National Party","Hold","Neil","Gray","Scottish National Party",2000,200,"New MP","Anum Qaisar",null,"Not Manufacturing Dependent",6.666666666666667,6.7,6.7,140,{"$f":"VLOOKUP(B13,'2022emp'!$A$2:$B$633,2,FALSE)","v":2500},{"$f":"VLOOKUP(B13,'2022emp'!$A$2:$F$633,4,FALSE)","v":34000},{"$f":"VLOOKUP(B13,'2022emp'!$A$2:$H$633,7,FALSE)","v":2250},{"$f":"VLOOKUP(B13,'2022emp'!$A$2:$H$633,8,FALSE)","v":250},-5,7.3529411764705888,"Not Manufacturing Dependent",7.4]
["South East","Aldershot",3000,52000,5.7692307692307692,205,215,215,-10,-10,"Leo","Docherty","Conservative","Hold","Leo","Docherty","Conservative",2500,300,"Same MP","Leo Docherty",null,"Not Manufacturing Dependent",6.3636363636363633,6.4,6.4,190,{"$f":"VLOOKUP(B14,'2022emp'!$A$2:$B$633,2,FALSE)","v":3000},{"$f":"VLOOKUP(B14,'2022emp'!$A$2:$F$633,4,FALSE)","v":63000},{"$f":"VLOOKUP(B14,'2022emp'!$A$2:$H$633,7,FALSE)","v":2500},{"$f":"VLOOKUP(B14,'2022emp'!$A$2:$H$633,8,FALSE)","v":300},-25,4.7619047619047619,"Not Manufacturing Dependent",4.8]
["West Midlands","Aldridge-Brownhills",4500,23000,19.565217391304348,260,240,250,10,20,"Wendy","Morton","Conservative","Hold","Wendy","Morton","Conservative",4000,400,"Same MP","Wendy Morton",null,"Very Manufacturing Dependent",20,20,20,245,{"$f":"VLOOKUP(B15,'2022emp'!$A$2:$B$633,2,FALSE)","v":4500},{"$f":"VLOOKUP(B15,'2022emp'!$A$2:$F$633,4,FALSE)","v":24000},{"$f":"VLOOKUP(B15,'2022emp'!$A$2:$H$633,7,FALSE)","v":4000},{"$f":"VLOOKUP(B15,'2022emp'!$A$2:$H$633,8,FALSE)","v":500},5,18.75,"Very Manufacturing Dependent",18.8]
["North West","Altrincham and Sale West",2500,51000,4.9019607843137258,185,185,175,10,0,"Graham","Brady","Conservative","Hold","Graham","Brady","Conservative",2000,400,"Same MP","Graham Brady",null,"Not Manufacturing Dependent",3.8461538461538463,3.8,3.8,165,{"$f":"VLOOKUP(B16,'2022emp'!$A$2:$B$633,2,FALSE)","v":1250},{"$f":"VLOOKUP(B16,'2022emp'!$A$2:$F$633,4,FALSE)","v":74000},{"$f":"VLOOKUP(B16,'2022emp'!$A$2:$H$633,7,FALSE)","v":1000},{"$f":"VLOOKUP(B16,'2022emp'!$A$2:$H$633,8,FALSE)","v":150},-20,1.6891891891891893,"Not Manufacturing Dependent",1.7]
["Wales","Alyn and Deeside",15000,48000,31.25,235,240,245,-10,-5,"Mark","Tami","Labour",{"$f":"IF(M17=Q17, \"Hold\", \"Change\")","v":"Hold"},"Mark","Tami","Labour",15000,600,"Same MP","Mark Tami",null,"Extremely Manufacturing Dependent",34.693877551020407,34.700000000000003,34.700000000000003,230,{"$f":"VLOOKUP(B17,'2022emp'!$A$2:$B$633,2,FALSE)","v":13000},{"$f":"VLOOKUP(B17,'2022emp'!$A$2:$F$633,4,FALSE)","v":48000},{"$f":"VLOOKUP(B17,'2022emp'!$A$2:$H$633,7,FALSE)","v":13000},{"$f":"VLOOKUP(B17,'2022emp'!$A$2:$H$633,8,FALSE)","v":500},-10,27.083333333333332,"Extremely Manufacturing Dependent",27.1]
["East Midlands","Amber Valley",9000,37000,24.324324324324326,310,290,290,20,20,"Nigel","Mills","Conservative","Hold","Nigel","Mills","Conservative",8000,1000,"Same MP","Nigel Mills",null,"Extremely Manufacturing Dependent",23.684210526315788,23.7,23.7,305,{"$f":"VLOOKUP(B18,'2022emp'!$A$2:$B$633,2,FALSE)","v":8000},{"$f":"VLOOKUP(B18,'2022emp'!$A$2:$F$633,4,FALSE)","v":38000},{"$f":"VLOOKUP(B18,'2022emp'!$A$2:$H$633,7,FALSE)","v":7000},{"$f":"VLOOKUP(B18,'2022emp'!$A$2:$H$633,8,FALSE)","v":600},15,21.052631578947366,"Very Manufacturing Dependent",21.1]
["Scotland","Angus",4500,26000,17.307692307692307,195,190,195,0,5,"Dave","Doogan","Scottish National Party","Hold","Dave","Doogan","Scottish National Party",4000,250,"Same MP","Dave Doogan",null,"Very Manufacturing Dependent",16.071428571428573,16.100000000000001,16.100000000000001,175,{"$f":"VLOOKUP(B19,'2022emp'!$A$2:$B$633,2,FALSE)","v":4500},{"$f":"VLOOKUP(B19,'2022emp'!$A$2:$F$633,4,FALSE)","v":28000},{"$f":"VLOOKUP(B19,'2022emp'!$A$2:$H$633,7,FALSE)","v":4000},{"$f":"VLOOKUP(B19,'2022emp'!$A$2:$H$633,8,FALSE)","v":350},-15,16.071428571428573,"Manufacturing Dependent",16.100000000000001]
["Wales","Arfon",1250,30000,4.1666666666666661,105,100,105,0,5,"Hywel","Williams","Plaid Cymru","Hold","Hywel","Williams","Plaid Cymru",1250,100,"Same MP","Hywel Williams",null,"Not Manufacturing Dependent",4.6875,4.7,4.7,110,{"$f":"VLOOKUP(B20,'2022emp'!$A$2:$B$633,2,FALSE)","v":1750},{"$f":"VLOOKUP(B20,'2022emp'!$A$2:$F$633,4,FALSE)","v":32000},{"$f":"VLOOKUP(B20,'2022emp'!$A$2:$H$633,7,FALSE)","v":1750},{"$f":"VLOOKUP(B20,'2022emp'!$A$2:$H$633,8,FALSE)","v":150},10,5.46875,"Not Manufacturing Dependent",5.5]
{"$rows_left_out":673}
{"sheet":"Mfg Jobs By Party and Region","index":2,"n_rows":57,"n_cols":2,"rows_kept":57,"cut":false,"hidden":true,"merged":[[0,0,0,1]]}
["Manufacturing Jobs by Party and Region Summary Table"]
[]
["Row Labels","Sum of Mfg Employee count 2018"]
["East Midlands",263250]
["Conservative",206750]
["Labour",54000]
["Labour/Co-operative",2500]
["Eastern",212400]
["Conservative",192400]
["Labour",18000]
["Liberal Democrat",2000]
["London",110850]
["Conservative",30450]
["Labour",65550]
["Labour/Co-operative",11900]
["Liberal Democrat",2950]
["North East",114250]
["Conservative",38750]
["Labour",75500]
["North West",319725]
{"$rows_left_out":38}
{"sheet":"Cons Above average mfg","index":3,"n_rows":162,"n_cols":16,"rows_kept":162,"cut":false,"hidden":true,"merged":[]}
[]
[null,"Legend:","1x average","2x average","3x average"]
["parliamentary constituency 2010","Mfg Employee count 2018","Total Constit Employee count 2018","MFG job percent of total","2019 Business count","2014 Business Count","2018 Business count","1-Year Change Business Count","5-Year Change Business Count","First name","Last name","Party","Hold or Change","First name","Last name","Party"]
["Copeland",12000,38000,31.578947368421051,145,135,145,0,10,"Trudy","Harrison","Conservative","Hold","Trudy","Harrison","Conservative"]
["Pendle",10000,33000,30.303030303030305,285,280,290,-5,5,"Andrew","Stephenson","Conservative","Hold","Andrew","Stephenson","Conservative"]
["Kenilworth and Southam",12000,46000,26.086956521739129,265,265,260,5,0,"Jeremy","Wright","Conservative","Hold","Jeremy","Wright","Conservative"]
["Fylde",10000,39000,25.641025641025639,170,160,175,-5,10,"Mark","Menzies","Conservative","Hold","Mark","Menzies","Conservative"]
["Amber Valley",9000,38000,23.684210526315788,290,290,290,0,0,"Nigel","Mills","Conservative","Hold","Nigel","Mills","Conservative"]
["South Holland and The Deepings",9000,40000,22.5,210,210,215,-5,0,"John","Hayes","Conservative","Hold","John","Hayes","Conservative"]
["Rossendale and Darwen",6000,27000,22.222222222222221,290,285,300,-10,5,"Jake","Berry","Conservative","Hold","Jake","Berry","Conservative"]
["Redditch",9000,41000,21.951219512195124,340,360,335,5,-20,"Rachel","Maclean","Conservative","Hold","Rachel","Maclean","Conservative"]
["South Derbyshire",7000,32000,21.875,255,215,245,10,40,"Heather","Wheeler","Conservative","Hold","Heather","Wheeler","Conservative"]
["Cleethorpes",8000,39000,20.512820512820511,205,180,200,5,25,"Martin","Vickers","Conservative","Hold","Martin","Vickers","Conservative"]
["Thirsk and Malton",8000,39000,20.512820512820511,380,335,370,10,45,"Kevin","Hollinrake","Conservative","Hold","Kevin","Hollinrake","Conservative"]
["Tewkesbury",11000,54000,20.37037037037037,295,300,285,10,-5,"Laurence","Robertson","Conservative","Hold","Laurence","Robertson","Conservative"]
["Ribble Valley",12000,59000,20.33898305084746,325,300,320,5,25,"Nigel","Evans","Conservative","Hold","Nigel","Evans","Conservative"]
["Aldridge-Brownhills",5000,25000,20,250,225,240,10,25,"Wendy","Morton","Conservative","Hold","Wendy","Morton","Conservative"]
["Calder Valley",9000,45000,20,435,430,435,0,5,"Craig","Whittaker","Conservative","Hold","Craig","Whittaker","Conservative"]
["Dudley South",8000,40000,20,410,385,390,20,25,"Mike","Wood","Conservative","Hold","Mike","Wood","Conservative"]
["Erewash",7000,35000,20,375,350,385,-10,25,"Maggie","Throup","Conservative","Hold","Maggie","Throup","Conservative"]
{"$rows_left_out":143}
{"sheet":"2022emp","index":4,"n_rows":633,"n_cols":8,"rows_kept":633,"cut":false,"hidden":true,"merged":[]}
["Constit","MfgEMp","%of Emp","Emp","Ft","Pt","FtMFG","PtMFG"]
["Aberavon",7000,20.6,34000,24000,10000,7000,350]
["Aberconwy",600,2.7,22000,12000,9000,500,75]
["Aberdeen North",700,1,69000,42000,27000,600,75]
["Aberdeen South",3000,5.4,56000,41000,14000,2500,350]
["Airdrie and Shotts",2500,7.4,34000,25000,9000,2250,250]
["Aldershot",3000,4.8,63000,46000,17000,2500,300]
["Aldridge-Brownhills",4500,18.8,24000,16000,8000,4000,500]
["Altrincham and Sale West",1250,1.7,74000,55000,19000,1000,150]
["Alyn and Deeside",13000,27.1,48000,35000,12000,13000,500]
["Amber Valley",8000,21.1,38000,27000,11000,7000,600]
["Angus",4500,16.100000000000001,28000,19000,9000,4000,350]
["Arfon",1750,5.5,32000,19000,13000,1750,150]
["Argyll and Bute",1750,4.9000000000000004,36000,24000,12000,1500,250]
["Arundel and South Downs",2500,6.9,36000,22000,14000,2250,400]
["Ashfield",8000,15.1,53000,36000,17000,7000,500]
["Ashford",4500,7.8,58000,39000,19000,3500,700]
["Ashton-under-Lyne",3000,8.3000000000000007,36000,25000,12000,3000,250]
["Aylesbury",3000,5.2,58000,41000,17000,2500,300]
["Ayr, Carrick and Cumnock",1750,5.3,33000,20000,13000,1500,225]
{"$rows_left_out":614}
{"sheet":"redundant Data","index":5,"n_rows":671,"n_cols":20,"rows_kept":671,"cut":false,"hidden":true,"merged":[[6,10,6,12],[6,14,6,16]]}
["JB Manufacturing Constituency Tool"]
["Sources: ONS, Theyworkforyou, Parliament",null,"Use the filters below to extract data to requirements. E.g. You could find newly elected MPs in constituencies in the North East which are manufacturing dependent who held conservative in the 2019 GE"]
[]
[]
[null,null,null,null,"Yellow: Above average"]
[null,null,"Data missing (NI)",null,"Orange: Above 2x the average"]
[null,null,null,null,"Red: Above 3x the average",null,null,null,null,null,"Post December 2019 MPs",null,null,null,"Pre december 2019 MPs",null,null,"Full-time Mfg employees","Part-time Mfg employees"]
["Region","parliamentary constituency 2010","Mfg Employee count 2018","Total Constit Employee count 2018","MFG job percent of total (Yellow higher than average :manufacturing dependent)","2019 Mfg Business count","2014 Mfg Business Count","2018 Mfg Business count","1-Year Change Business Count","5-Year Change Business Count","First name","Last name","Party","Hold or Change","First name","Last name","Party","number","number","New or Same MP?"]
["Wales","Aberavon",8000,31000,{"$f":"(C9/D9)*100","v":25.806451612903224},110,105,105,{"$f":"F9-H9","v":5},{"$f":"F9-G9","v":5},"Stephen","Kinnock","Labour",{"$f":"IF(M9=Q9, \"Hold\", \"Change\")","v":"Hold"},"Stephen","Kinnock","Labour",8000,225,{"$f":"IF(L9=P9, \"Same MP\", \"New MP\")","v":"Same MP"}]
["Wales","Aberconwy",600,27000,{"$f":"(C10/D10)*100","v":2.2222222222222223},105,95,100,5,10,"Robin John","Millar","Conservative",{"$f":"IF(M10=Q10, \"Hold\", \"Change\")","v":"Change"},"Guto","Bebb","Independent",500,45,{"$f":"IF(L10=P10, \"Same MP\", \"New MP\")","v":"New MP"}]
["Scotland","Aberdeen North",1000,75000,{"$f":"(C11/D11)*100","v":1.3333333333333335},100,105,100,0,-5,"Kirsty","Blackman","Scottish National Party","Hold","Kirsty","Blackman","Scottish National Party",1000,125,"Same MP"]
["Scotland","Aberdeen South",3000,61000,4.918032786885246,195,175,205,-10,20,"Stephen","Flynn","Scottish National Party","Change","Ross","Thomson","Conservative",3000,350,"New MP"]
["Scotland","Airdrie and Shotts",2000,30000,6.666666666666667,145,120,145,0,25,"Neil","Gray","Scottish National Party","Hold","Neil","Gray","Scottish National Party",1750,150,"Same MP"]
["South East","Aldershot",3500,55000,6.3636363636363633,215,200,215,0,15,"Leo","Docherty","Conservative","Hold","Leo","Docherty","Conservative",3000,300,"Same MP"]
["West Midlands","Aldridge-Brownhills",5000,25000,20,250,225,240,10,25,"Wendy","Morton","Conservative","Hold","Wendy","Morton","Conservative",4500,400,"Same MP"]
["North West","Altrincham and Sale West",2000,52000,3.8461538461538463,175,165,185,-10,10,"Graham","Brady","Conservative","Hold","Graham","Brady","Conservative",2000,125,"Same MP"]
["Wales","Alyn and Deeside",17000,49000,34.693877551020407,245,215,240,5,30,"Mark","Tami","Labour","Hold","Mark","Tami","Labour",17000,350,"Same MP"]
["East Midlands","Amber Valley",9000,38000,23.684210526315788,290,290,290,0,0,"Nigel","Mills","Conservative","Hold","Nigel","Mills","Conservative",9000,700,"Same MP"]
["Scotland","Angus",4500,28000,16.071428571428573,195,165,190,5,30,"Dave","Doogan","Scottish National Party","Change","Kirstene","Hair","Conservative",4000,250,"New MP"]
["Wales","Arfon",1500,32000,4.6875,105,90,100,5,15,"Hywel","Williams","Plaid Cymru","Hold","Hywel","Williams","Plaid Cymru",1250,125,"Same MP"]
{"$rows_left_out":651}